{"text_format":"1","workbook":"xlsx","n_sheets":7,"sheets":["Enable Macros","Budget","Cellular","Calls","Data","Messages","CashFlow"],"not_rendered":{"charts":0,"images":3,"macros":1,"external_links":0,"defined_names":3,"comments":0,"pivot_tables":0},"unopened":[],"bounds":{"document_bytes":16777216,"sheet_cells":100000,"rows_first":2000,"rows_last":500,"rows_between":2000,"halvings":0,"cell_chars":16384,"cell_head_chars":4096},"cells_cut":0,"cells_raw":0,"read":"whole","date_system":"1900"}

{"sheet":"Enable Macros","index":0,"n_rows":27,"n_cols":27,"rows_kept":27,"cut":false,"hidden":true,"merged":[]}
[null,null,null,null,null,null,null,null,null,null,null,null,null,null,null,null,null,null,null,null,null,null,null,null,null,null,"' this module is for code that is very specific to a particular assignment,  It is not  archived to the code vault"]
[null,"Budget",null,null,null,null,null,null,null,null,null,null,null,null,null,null,null,null,null,null,null,null,null,null,null,null,""]
[null,"Cellular",null,null,null,null,null,null,null,null,null,null,null,null,null,null,null,null,null,null,null,null,null,null,null,null,""]
[null,"Calls",null,null,null,null,null,null,null,null,null,null,null,null,null,null,null,null,null,null,null,null,null,null,null,null,"Sub loadAssignmentSpecificTools(f As frmSubmit)"]
[null,"Data",null,null,null,null,null,null,null,null,null,null,null,null,null,null,null,null,null,null,null,null,null,null,null,null,"  'this proc is called by frmSubmit to build names of assignment-specific tools"]
[null,"Messages",null,null,null,null,null,null,null,null,null,null,null,null,null,null,null,null,null,null,null,null,null,null,null,null,"  "]
[null,"CashFlow",null,null,null,null,null,null,null,null,null,null,null,null,null,null,null,null,null,null,null,null,null,null,null,null,"  'f.cboTool.AddItem \"Show Time\""]
[null,null,null,null,null,null,null,null,null,null,null,null,null,null,null,null,null,null,null,null,null,null,null,null,null,null," "]
[null,null,null,null,null,null,null,null,null,null,null,null,null,null,null,null,null,null,null,null,null,null,null,null,null,null,"End Sub"]
[null,null,null,null,null,null,null,null,null,null,null,null,null,null,null,null,null,null,null,null,null,null,null,null,null,null,"Function runAssignmentSpecificTool(f As frmSubmit) As Boolean"]
[null,null,null,null,null,null,null,null,null,null,null,null,null,null,null,null,null,null,null,null,null,null,null,null,null,null,"  runAssignmentSpecificTool = True"]
[null,null,null,null,null,null,null,null,null,null,null,null,null,null,null,null,null,null,null,null,null,null,null,null,null,null,"  Select Case f.cboTool.value"]
[null,null,null,null,null,null,null,null,null,null,null,null,null,null,null,null,null,null,null,null,null,null,null,null,null,null,"  '  Case \"Show Time\": show_time f"]
[null,null,null,null,null,null,null,null,null,null,null,null,null,null,null,null,null,null,null,null,null,null,null,null,null,null,"    Case Else: runAssignmentSpecificTool = False"]
[null,null,null,null,null,null,null,null,null,null,null,null,null,null,null,null,null,null,null,null,null,null,null,null,null,null,"  End Select"]
[null,null,null,null,null,null,null,null,null,null,null,null,null,null,null,null,null,null,null,null,null,null,null,null,null,null,"End Function"]
[null,null,null,null,null,null,null,null,null,null,null,null,null,null,null,null,null,null,null,null,null,null,null,null,null,null,""]
[null,null,null,null,null,null,null,null,null,null,null,null,null,null,null,null,null,null,null,null,null,null,null,null,null,null,""]
[null,null,null,null,null,null,null,null,null,null,null,null,null,null,null,null,null,null,null,null,null,null,null,null,null,null,"Sub assignmentSpecificCode(Optional junk As Boolean)"]
[null,null,null,null,null,null,null,null,null,null,null,null,null,null,null,null,null,null,null,null,null,null,null,null,null,null,""]
[null,null,null,null,null,null,null,null,null,null,null,null,null,null,null,null,null,null,null,null,null,null,null,null,null,null,"End Sub"]
[null,null,null,null,null,null,null,null,null,null,null,null,null,null,null,null,null,null,null,null,null,null,null,null,null,null,""]
[null,null,null,null,null,null,null,null,null,null,null,null,null,null,null,null,null,null,null,null,null,null,null,null,null,null,""]
[null,null,null,null,null,null,null,null,null,null,null,null,null,null,null,null,null,null,null,null,null,null,null,null,null,null,""]
[null,null,null,null,null,null,null,null,null,null,null,null,null,null,null,null,null,null,null,null,null,null,null,null,null,null,""]
[null,null,null,null,null,null,null,null,null,null,null,null,null,null,null,null,null,null,null,null,null,null,null,null,null,null,""]
[null,null,null,null,null,null,null,null,null,null,null,null,null,null,null,null,null,null,null,null,null,null,null,null,null,null,""]

{"sheet":"Budget","index":1,"n_rows":28,"n_cols":4,"rows_kept":28,"cut":false,"hidden":false,"merged":[[1,1,6,9]]}
[]
[null,"Prepare a personal budget for one month. Be sure to think through your sources of income and expenses. Be as detailed as you wish; but include cells that calculate the following: Income (which calculates the sum of all income sources), Expenses (which calculates the sum of all expenses), and Savings (which calculates the difference between the total income and expenses).  After completing your budget, complete the tasks to create named ranges that reference the important cells outlined above."]
[]
[]
[]
[]
[]
[]
[null,null,null," Monthly Budget"]
[null,"Income"]
[null,"Fulltime Job",4800]
[null,"Tuition",1200]
[null,"Support",1800]
[null,"Interest",700]
[]
[null,null,{"$f":"SUM(Income)","v":8500}]
[]
[null,"Expense"]
[null,"Rent",1000]
[null,"Electricity/Gas Bill",500]
[null,"Wifi",60]
[null,"Food",1000]
[null,"Alcohol/Party",800]
[null,"Fuel",400]
[null,null,{"$f":"SUM(Expenses)","v":3760}]
[]
[null,"Savings"]
[null,"Ending balance",{"$f":"SUM(Income)-SUM(Expenses)","v":4740}]

{"sheet":"Cellular","index":2,"n_rows":28,"n_cols":9,"rows_kept":28,"cut":false,"hidden":false,"merged":[[1,1,1,2],[1,4,1,5],[1,7,1,8],[18,4,21,5],[23,1,29,5]]}
[]
[null,"Plan Options",null,null,"Usage Summary",null,null,"Plan Costs"]
[null,"Option 1 - Pay-as-you-go",null,null,"Calls",null,null,"Option 1 - Pay-as-you-go"]
[null,"Minute Charges",0.05,null,"Weekday Daytime Minutes",{"$f":"SUMIF(Calls!$H$3:$H$554,Cellular!E4,Calls!$I$3:$I$554)","v":947},null,"Minute Charges",{"$f":"F6*C4","v":85.300000000000011}]
[null,"Data Charges per Megabyte",0.03,null,"Evening & Weekend Minutes",{"$f":"F6-F4","v":759},null,"Data Charges**",{"$f":"C5*F8*1024","v":24.405205078125}]
[null,"Text Messages Included (no media)",500,null,"Total Minutes Used",{"$f":"SUM(Calls!$I$3:$I$554)","v":1706},null,"Text Message Charges",{"$f":"(F11-C6)*C7","v":9.9}]
[null,"Text Message Charges",0.05,null,null,null,null,"Media Message Charges",{"$f":"F12*C8","v":17.900000000000002}]
[null,"Media Message Charges",0.1,null,"Data Used (gigabytes)",{"$f":"SUM(Data!D3:D766)/F16","v":0.79444026947021484}]
[null,null,null,null,null,null,null,"Total Charges",{"$f":"SUM(I4:I7)","v":137.50520507812502}]
[null,"Option 2 - Rate Plan w/Overages",null,null,"Messaging",null,null,"Taxes and Fees (cell F15)",{"$f":"I9*F15","v":24.750936914062503}]
[null,"Monthly Cost",89,null,"Text Messages Sent",{"$f":"COUNTIF(Messages!D3:D879,\"Text\")","v":698},null,"Total Bill",{"$f":"SUM(I9:I10)","v":162.25614199218751}]
[null,"Minutes Included*",700,null,"Media Messages Sent",{"$f":"COUNTIF(Messages!D3:D879,\"Media\")","v":179}]
[null,"Data Included (gigabytes)",1,null,"Total Messages Sent",{"$f":"SUM(F11:F12)","v":877},null,"Option 2 - Rate Plan w/Overages"]
[null,"Messages (any type) Included",1000,null,null,null,null,"Monthly Cost",{"$f":"C11","v":89}]
[null,"Over-minute Charges",0.1,null,"Cellular Tax/Fee Rate",0.18,null,"Over-minute Charges*",{"$f":"(F4-C12)*C15","v":24.700000000000003}]
[null,"Over-data Charges per megabyte",0.05,null,"# Kilobytes in a Gigabyte**",1048576,null,"Over-data Charges**",{"$f":"IF(F8>C13,(F8-C13)*1024*C16,0)","v":0}]
[null,"Over-message Charges per message",0.1,null,"# Megabytes in a Gigabyte**",1024,null,"Additional Message Charges",{"$f":"IF(F13>C14,(F13-C14)*C17,0)","v":0}]
[]
[null,"Option 3 - Unlimited",null,null,"** Note: There are 1024 kilobytes in a megabyte and 1024 megabytes in a gigabyte. Therefore there are 1048576 kilobytes in a gigabyte (1024 x 1024).",null,null,"Total Charges",{"$f":"SUM(I14:I17)","v":113.7}]
[null,"Rate",119,null,null,null,null,"Taxes and Fees (cell F15)",{"$f":"I19*F15","v":20.466000000000001}]
[null,null,null,null,null,null,null,"Total Bill",{"$f":"SUM(I19:I20)","v":134.166}]
[null,"* Night and weekend minutes are free for Option 2"]
[null,null,null,null,null,null,null,"Option 3 - Unlimited"]
[null,"You are planning to switch your cell phone provider and there are three options available to you. You could choose a pay-as-you-go plan, a traditional plan (which includes an allowance for minutes, data, and text and penalties for exceeding these allowances), and an unlimited plan. You want to evaluate which plan will be best for you. You have imported your calls, data usage, and text message usage from the last month with your previous provider into separate worksheets in the workbook (Calls, Data, and Messages, respectively) so that you can how much each plan would cost you based on your usage that month. Complete the tasks to compare your bill for each plan option.",null,null,null,null,null,"Monthly Cost",{"$f":"C20","v":119}]
[]
[null,null,null,null,null,null,null,"Total Charges",{"$f":"I24","v":119}]
[null,null,null,null,null,null,null,"Taxes and Fees (cell F15)",{"$f":"I26*F15","v":21.419999999999998}]
[null,null,null,null,null,null,null,"Total Bill",{"$f":"SUM(I26:I27)","v":140.41999999999999}]

{"sheet":"Calls","index":3,"n_rows":554,"n_cols":9,"rows_kept":554,"cut":false,"hidden":false,"merged":[]}
[]
[null,"Day","Date","Time","Minutes","Weekday?","Daytime?","Weekday/Daytime?","Time Charged"]
[null,"Monday","2012-10-01","11:28:00",1.62,{"$f":"IF(OR(B3=\"Sunday\",B3=\"Saturday\"),\"No\",\"Yes\")","v":"Yes"},{"$f":"IF(D3<0.7916,\"Yes\",\"No\")","v":"Yes"},{"$f":"IF(AND(F3=\"yes\",G3=\"yes\"),\"Weekday Daytime Minutes\",\"Evening & Weekend Minutes\")","v":"Weekday Daytime Minutes"},{"$f":"ROUNDUP(E3,0)","v":2}]
[null,"Monday","2012-10-01","12:38:00",2.2400000000000002,{"$f":"IF(OR(B4=\"Sunday\",B4=\"Saturday\"),\"No\",\"Yes\")","v":"Yes"},{"$f":"IF(D4<0.7916,\"Yes\",\"No\")","v":"Yes"},{"$f":"IF(AND(F4=\"yes\",G4=\"yes\"),\"Weekday Daytime Minutes\",\"Evening & Weekend Minutes\")","v":"Weekday Daytime Minutes"},{"$f":"ROUNDUP(E4,0)","v":3}]
[null,"Monday","2012-10-01","13:10:00",0.46,"Yes","Yes","Weekday Daytime Minutes",1]
[null,"Monday","2012-10-01","13:16:00",0.27,"Yes","Yes","Weekday Daytime Minutes",1]
[null,"Monday","2012-10-01","13:20:00",4.9800000000000004,"Yes","Yes","Weekday Daytime Minutes",5]
[null,"Monday","2012-10-01","14:41:00",0.44,"Yes","Yes","Weekday Daytime Minutes",1]
[null,"Monday","2012-10-01","14:49:00",1.57,"Yes","Yes","Weekday Daytime Minutes",2]
[null,"Monday","2012-10-01","15:33:00",0.25,"Yes","Yes","Weekday Daytime Minutes",1]
[null,"Monday","2012-10-01","15:37:00",0.08,"Yes","Yes","Weekday Daytime Minutes",1]
[null,"Monday","2012-10-01","15:41:00",2.0699999999999998,"Yes","Yes","Weekday Daytime Minutes",3]
[null,"Monday","2012-10-01","16:12:00",1.3,"Yes","Yes","Weekday Daytime Minutes",2]
[null,"Monday","2012-10-01","17:04:00",0.36,"Yes","Yes","Weekday Daytime Minutes",1]
[null,"Monday","2012-10-01","17:08:00",0.72,"Yes","Yes","Weekday Daytime Minutes",1]
[null,"Monday","2012-10-01","17:20:00",3.5,"Yes","Yes","Weekday Daytime Minutes",4]
[null,"Monday","2012-10-01","18:30:00",3.45,"Yes","Yes","Weekday Daytime Minutes",4]
[null,"Monday","2012-10-01","19:39:00",1.29,"Yes","No","Evening & Weekend Minutes",2]
[null,"Monday","2012-10-01","20:35:00",0.05,"Yes","No","Evening & Weekend Minutes",1]
[null,"Monday","2012-10-01","20:38:00",2.75,"Yes","No","Evening & Weekend Minutes",3]
[null,"Tuesday","2012-10-02","10:00:00",2.58,"Yes","Yes","Weekday Daytime Minutes",3]
[null,"Tuesday","2012-10-02","10:31:00",0.83,"Yes","Yes","Weekday Daytime Minutes",1]
[null,"Tuesday","2012-10-02","10:41:00",0.36,"Yes","Yes","Weekday Daytime Minutes",1]
[null,"Tuesday","2012-10-02","10:45:00",2.1800000000000002,"Yes","Yes","Weekday Daytime Minutes",3]
[null,"Tuesday","2012-10-02","11:56:00",1.29,"Yes","Yes","Weekday Daytime Minutes",2]
[null,"Tuesday","2012-10-02","12:25:00",1.51,"Yes","Yes","Weekday Daytime Minutes",2]
[null,"Tuesday","2012-10-02","12:53:00",0.14000000000000001,"Yes","Yes","Weekday Daytime Minutes",1]
[null,"Tuesday","2012-10-02","13:02:00",4.18,"Yes","Yes","Weekday Daytime Minutes",5]
[null,"Tuesday","2012-10-02","13:48:00",1.7,"Yes","Yes","Weekday Daytime Minutes",2]
[null,"Tuesday","2012-10-02","14:39:00",5.6,"Yes","Yes","Weekday Daytime Minutes",6]
[null,"Tuesday","2012-10-02","15:49:00",1,"Yes","Yes","Weekday Daytime Minutes",1]
[null,"Tuesday","2012-10-02","16:03:00",0.82,"Yes","Yes","Weekday Daytime Minutes",1]
[null,"Tuesday","2012-10-02","17:33:00",1.75,"Yes","Yes","Weekday Daytime Minutes",2]
[null,"Tuesday","2012-10-02","17:54:00",1.35,"Yes","Yes","Weekday Daytime Minutes",2]
[null,"Tuesday","2012-10-02","18:38:00",0.34,"Yes","Yes","Weekday Daytime Minutes",1]
[null,"Tuesday","2012-10-02","19:09:00",0.65,"Yes","No","Evening & Weekend Minutes",1]
[null,"Tuesday","2012-10-02","19:33:00",0.36,"Yes","No","Evening & Weekend Minutes",1]
[null,"Tuesday","2012-10-02","20:23:00",3.84,"Yes","No","Evening & Weekend Minutes",4]
[null,"Tuesday","2012-10-02","21:11:00",0.4,"Yes","No","Evening & Weekend Minutes",1]
[null,"Tuesday","2012-10-02","21:15:00",1,"Yes","No","Evening & Weekend Minutes",1]
[null,"Tuesday","2012-10-02","21:30:00",1.2,"Yes","No","Evening & Weekend Minutes",2]
[null,"Tuesday","2012-10-02","22:48:00",2.5,"Yes","No","Evening & Weekend Minutes",3]
[null,"Wednesday","2012-10-03","11:07:00",0.56999999999999995,"Yes","Yes","Weekday Daytime Minutes",1]
[null,"Wednesday","2012-10-03","11:15:00",0.22,"Yes","Yes","Weekday Daytime Minutes",1]
[null,"Wednesday","2012-10-03","11:21:00",0.21,"Yes","Yes","Weekday Daytime Minutes",1]
[null,"Wednesday","2012-10-03","11:31:00",0.22,"Yes","Yes","Weekday Daytime Minutes",1]
[null,"Wednesday","2012-10-03","11:42:00",0.38,"Yes","Yes","Weekday Daytime Minutes",1]
[null,"Wednesday","2012-10-03","11:47:00",0.41,"Yes","Yes","Weekday Daytime Minutes",1]
[null,"Wednesday","2012-10-03","11:56:00",3.82,"Yes","Yes","Weekday Daytime Minutes",4]
[null,"Wednesday","2012-10-03","12:38:00",69.3,"Yes","Yes","Weekday Daytime Minutes",70]
[null,"Wednesday","2012-10-03","13:55:00",1.47,"Yes","Yes","Weekday Daytime Minutes",2]
[null,"Wednesday","2012-10-03","14:28:00",4.9400000000000004,"Yes","Yes","Weekday Daytime Minutes",5]
[null,"Wednesday","2012-10-03","15:57:00",0.28999999999999998,"Yes","Yes","Weekday Daytime Minutes",1]
[null,"Wednesday","2012-10-03","16:02:00",0.1,"Yes","Yes","Weekday Daytime Minutes",1]
[null,"Wednesday","2012-10-03","16:15:00",2.2000000000000002,"Yes","Yes","Weekday Daytime Minutes",3]
[null,"Thursday","2012-10-04","09:13:00",2.38,"Yes","Yes","Weekday Daytime Minutes",3]
[null,"Thursday","2012-10-04","10:10:00",5.45,"Yes","Yes","Weekday Daytime Minutes",6]
[null,"Thursday","2012-10-04","11:25:00",1.54,"Yes","Yes","Weekday Daytime Minutes",2]
[null,"Thursday","2012-10-04","12:01:00",0.71,"Yes","Yes","Weekday Daytime Minutes",1]
[null,"Thursday","2012-10-04","12:12:00",0.12,"Yes","Yes","Weekday Daytime Minutes",1]
[null,"Thursday","2012-10-04","12:14:00",1.89,"Yes","Yes","Weekday Daytime Minutes",2]
[null,"Thursday","2012-10-04","12:58:00",1.23,"Yes","Yes","Weekday Daytime Minutes",2]
[null,"Thursday","2012-10-04","13:18:00",2.82,"Yes","Yes","Weekday Daytime Minutes",3]
[null,"Thursday","2012-10-04","14:05:00",1.38,"Yes","Yes","Weekday Daytime Minutes",2]
[null,"Thursday","2012-10-04","14:36:00",0.18,"Yes","Yes","Weekday Daytime Minutes",1]
[null,"Thursday","2012-10-04","14:40:00",1.33,"Yes","Yes","Weekday Daytime Minutes",2]
[null,"Friday","2012-10-05","08:14:00",0.02,"Yes","Yes","Weekday Daytime Minutes",1]
[null,"Friday","2012-10-05","08:15:00",0.14000000000000001,{"$f":"IF(OR(B68=\"Sunday\",B68=\"Saturday\"),\"No\",\"Yes\")","v":"Yes"},{"$f":"IF(D68<0.7916,\"Yes\",\"No\")","v":"Yes"},{"$f":"IF(AND(F68=\"yes\",G68=\"yes\"),\"Weekday Daytime Minutes\",\"Evening & Weekend Minutes\")","v":"Weekday Daytime Minutes"},{"$f":"ROUNDUP(E68,0)","v":1}]
[null,"Friday","2012-10-05","08:25:00",2.7,"Yes","Yes","Weekday Daytime Minutes",3]
[null,"Friday","2012-10-05","09:07:00",0.05,"Yes","Yes","Weekday Daytime Minutes",1]
[null,"Friday","2012-10-05","09:08:00",3.84,"Yes","Yes","Weekday Daytime Minutes",4]
[null,"Friday","2012-10-05","09:56:00",3.11,"Yes","Yes","Weekday Daytime Minutes",4]
[null,"Friday","2012-10-05","10:31:00",0.14000000000000001,"Yes","Yes","Weekday Daytime Minutes",1]
[null,"Friday","2012-10-05","10:37:00",0.27,"Yes","Yes","Weekday Daytime Minutes",1]
[null,"Friday","2012-10-05","10:47:00",4,"Yes","Yes","Weekday Daytime Minutes",4]
[null,"Friday","2012-10-05","11:42:00",2.93,"Yes","Yes","Weekday Daytime Minutes",3]
[null,"Friday","2012-10-05","12:21:00",4.2,"Yes","Yes","Weekday Daytime Minutes",5]
[null,"Friday","2012-10-05","13:31:00",0.38,"Yes","Yes","Weekday Daytime Minutes",1]
[null,"Friday","2012-10-05","14:13:00",3.29,"Yes","Yes","Weekday Daytime Minutes",4]
[null,"Friday","2012-10-05","15:27:00",1.4,"Yes","Yes","Weekday Daytime Minutes",2]
[null,"Friday","2012-10-05","15:48:00",0.4,"Yes","Yes","Weekday Daytime Minutes",1]
[null,"Friday","2012-10-05","16:00:00",0.09,"Yes","Yes","Weekday Daytime Minutes",1]
[null,"Friday","2012-10-05","16:12:00",0.34,"Yes","Yes","Weekday Daytime Minutes",1]
[null,"Friday","2012-10-05","16:34:00",2.1,"Yes","Yes","Weekday Daytime Minutes",3]
[null,"Friday","2012-10-05","16:55:00",3.76,"Yes","Yes","Weekday Daytime Minutes",4]
[null,"Friday","2012-10-05","17:42:00",1,"Yes","Yes","Weekday Daytime Minutes",1]
[null,"Friday","2012-10-05","18:42:00",1.96,"Yes","Yes","Weekday Daytime Minutes",2]
[null,"Friday","2012-10-05","19:10:00",2.5,"Yes","No","Evening & Weekend Minutes",3]
[null,"Saturday","2012-10-06","09:36:00",0.82,"No","Yes","Evening & Weekend Minutes",1]
[null,"Saturday","2012-10-06","10:13:00",2.73,"No","Yes","Evening & Weekend Minutes",3]
[null,"Saturday","2012-10-06","10:54:00",0.22,"No","Yes","Evening & Weekend Minutes",1]
[null,"Saturday","2012-10-06","11:16:00",5.0999999999999996,"No","Yes","Evening & Weekend Minutes",6]
[null,"Saturday","2012-10-06","12:07:00",0.83,"No","Yes","Evening & Weekend Minutes",1]
[null,"Saturday","2012-10-06","12:19:00",4.2,"No","Yes","Evening & Weekend Minutes",5]
[null,"Saturday","2012-10-06","13:01:00",97.4,"No","Yes","Evening & Weekend Minutes",98]
[null,"Saturday","2012-10-06","14:46:00",1.42,"No","Yes","Evening & Weekend Minutes",2]
[null,"Saturday","2012-10-06","15:03:00",0.2,"No","Yes","Evening & Weekend Minutes",1]
[null,"Saturday","2012-10-06","15:09:00",3.27,"No","Yes","Evening & Weekend Minutes",4]
[null,"Saturday","2012-10-06","15:49:00",0.67,"No","Yes","Evening & Weekend Minutes",1]
[null,"Saturday","2012-10-06","16:19:00",0.09,"No","Yes","Evening & Weekend Minutes",1]
[null,"Saturday","2012-10-06","16:27:00",1.59,"No","Yes","Evening & Weekend Minutes",2]
[null,"Saturday","2012-10-06","16:50:00",1.2,"No","Yes","Evening & Weekend Minutes",2]
[null,"Saturday","2012-10-06","17:20:00",2.5299999999999998,"No","Yes","Evening & Weekend Minutes",3]
[null,"Saturday","2012-10-06","17:58:00",0.49,"No","Yes","Evening & Weekend Minutes",1]
[null,"Saturday","2012-10-06","18:20:00",0.5,"No","Yes","Evening & Weekend Minutes",1]
[null,"Saturday","2012-10-06","18:30:00",2.37,"No","Yes","Evening & Weekend Minutes",3]
[null,"Saturday","2012-10-06","19:14:00",0.17,"No","No","Evening & Weekend Minutes",1]
[null,"Saturday","2012-10-06","19:36:00",1.47,"No","No","Evening & Weekend Minutes",2]
[null,"Saturday","2012-10-06","20:09:00",1.45,"No","No","Evening & Weekend Minutes",2]
[null,"Saturday","2012-10-06","20:38:00",2.78,"No","No","Evening & Weekend Minutes",3]
[null,"Sunday","2012-10-07","09:07:00",0.05,"No","Yes","Evening & Weekend Minutes",1]
[null,"Sunday","2012-10-07","09:10:00",0.11,"No","Yes","Evening & Weekend Minutes",1]
[null,"Sunday","2012-10-07","09:14:00",0.44,"No","Yes","Evening & Weekend Minutes",1]
[null,"Sunday","2012-10-07","09:25:00",2.1800000000000002,"No","Yes","Evening & Weekend Minutes",3]
[null,"Sunday","2012-10-07","09:49:00",0.15,"No","Yes","Evening & Weekend Minutes",1]
[null,"Sunday","2012-10-07","09:52:00",1.1499999999999999,"No","Yes","Evening & Weekend Minutes",2]
[null,"Sunday","2012-10-07","10:34:00",0.18,"No","Yes","Evening & Weekend Minutes",1]
[null,"Sunday","2012-10-07","10:40:00",0.83,"No","Yes","Evening & Weekend Minutes",1]
[null,"Sunday","2012-10-07","10:52:00",1.1599999999999999,"No","Yes","Evening & Weekend Minutes",2]
[null,"Sunday","2012-10-07","11:50:00",0.01,"No","Yes","Evening & Weekend Minutes",1]
[null,"Sunday","2012-10-07","11:50:00",0.06,"No","Yes","Evening & Weekend Minutes",1]
[null,"Sunday","2012-10-07","11:53:00",2.6,"No","Yes","Evening & Weekend Minutes",3]
[null,"Sunday","2012-10-07","12:32:00",0.12,"No","Yes","Evening & Weekend Minutes",1]
[null,"Sunday","2012-10-07","12:35:00",2.82,"No","Yes","Evening & Weekend Minutes",3]
[null,"Monday","2012-10-08","10:55:00",0.52,"Yes","Yes","Weekday Daytime Minutes",1]
[null,"Monday","2012-10-08","11:21:00",3.3,"Yes","Yes","Weekday Daytime Minutes",4]
[null,"Monday","2012-10-08","11:54:00",1.08,"Yes","Yes","Weekday Daytime Minutes",2]
[null,"Monday","2012-10-08","12:06:00",0.05,"Yes","Yes","Weekday Daytime Minutes",1]
[null,"Monday","2012-10-08","12:08:00",0.14000000000000001,"Yes","Yes","Weekday Daytime Minutes",1]
[null,"Monday","2012-10-08","12:10:00",0.02,"Yes","Yes","Weekday Daytime Minutes",1]
[null,"Monday","2012-10-08","12:13:00",1.36,"Yes","Yes","Weekday Daytime Minutes",2]
[null,"Monday","2012-10-08","12:30:00",1.66,{"$f":"IF(OR(B132=\"Sunday\",B132=\"Saturday\"),\"No\",\"Yes\")","v":"Yes"},{"$f":"IF(D132<0.7916,\"Yes\",\"No\")","v":"Yes"},{"$f":"IF(AND(F132=\"yes\",G132=\"yes\"),\"Weekday Daytime Minutes\",\"Evening & Weekend Minutes\")","v":"Weekday Daytime Minutes"},{"$f":"ROUNDUP(E132,0)","v":2}]
[null,"Monday","2012-10-08","12:59:00",0.13,"Yes","Yes","Weekday Daytime Minutes",1]
[null,"Monday","2012-10-08","13:08:00",0.48,"Yes","Yes","Weekday Daytime Minutes",1]
[null,"Monday","2012-10-08","13:56:00",0.61,"Yes","Yes","Weekday Daytime Minutes",1]
[null,"Monday","2012-10-08","14:39:00",0.06,"Yes","Yes","Weekday Daytime Minutes",1]
[null,"Monday","2012-10-08","14:40:00",1.25,"Yes","Yes","Weekday Daytime Minutes",2]
[null,"Monday","2012-10-08","15:26:00",0.05,"Yes","Yes","Weekday Daytime Minutes",1]
[null,"Monday","2012-10-08","15:32:00",1.99,"Yes","Yes","Weekday Daytime Minutes",2]
[null,"Monday","2012-10-08","16:09:00",1.71,"Yes","Yes","Weekday Daytime Minutes",2]
[null,"Tuesday","2012-10-09","08:17:00",2.36,"Yes","Yes","Weekday Daytime Minutes",3]
[null,"Tuesday","2012-10-09","08:43:00",5.8,"Yes","Yes","Weekday Daytime Minutes",6]
[null,"Tuesday","2012-10-09","09:41:00",1.32,"Yes","Yes","Weekday Daytime Minutes",2]
[null,"Tuesday","2012-10-09","10:14:00",3.5,"Yes","Yes","Weekday Daytime Minutes",4]
[null,"Tuesday","2012-10-09","11:04:00",1.96,"Yes","Yes","Weekday Daytime Minutes",2]
[null,"Tuesday","2012-10-09","11:48:00",0.39,"Yes","Yes","Weekday Daytime Minutes",1]
[null,"Tuesday","2012-10-09","11:53:00",0.01,"Yes","Yes","Weekday Daytime Minutes",1]
[null,"Tuesday","2012-10-09","11:53:00",1.46,"Yes","Yes","Weekday Daytime Minutes",2]
[null,"Tuesday","2012-10-09","12:27:00",2.29,"Yes","Yes","Weekday Daytime Minutes",3]
[null,"Tuesday","2012-10-09","13:03:00",0.66,"Yes","Yes","Weekday Daytime Minutes",1]
[null,"Tuesday","2012-10-09","13:14:00",0.47,"Yes","Yes","Weekday Daytime Minutes",1]
[null,"Tuesday","2012-10-09","13:28:00",0.4,"Yes","Yes","Weekday Daytime Minutes",1]
[null,"Tuesday","2012-10-09","13:56:00",1.58,"Yes","Yes","Weekday Daytime Minutes",2]
[null,"Tuesday","2012-10-09","14:15:00",1.54,"Yes","Yes","Weekday Daytime Minutes",2]
[null,"Tuesday","2012-10-09","14:37:00",1.33,"Yes","Yes","Weekday Daytime Minutes",2]
[null,"Tuesday","2012-10-09","14:53:00",0.53,"Yes","Yes","Weekday Daytime Minutes",1]
[null,"Tuesday","2012-10-09","14:59:00",3.14,"Yes","Yes","Weekday Daytime Minutes",4]
[null,"Tuesday","2012-10-09","15:50:00",2.2200000000000002,"Yes","Yes","Weekday Daytime Minutes",3]
[null,"Wednesday","2012-10-10","12:09:00",1.31,"Yes","Yes","Weekday Daytime Minutes",2]
[null,"Wednesday","2012-10-10","12:27:00",0.45,"Yes","Yes","Weekday Daytime Minutes",1]
[null,"Wednesday","2012-10-10","12:32:00",0.47,"Yes","Yes","Weekday Daytime Minutes",1]
[null,"Wednesday","2012-10-10","12:53:00",1.6,"Yes","Yes","Weekday Daytime Minutes",2]
[null,"Wednesday","2012-10-10","13:41:00",0.04,"Yes","Yes","Weekday Daytime Minutes",1]
[null,"Wednesday","2012-10-10","13:46:00",0.39,"Yes","Yes","Weekday Daytime Minutes",1]
[null,"Wednesday","2012-10-10","13:51:00",0.77,"Yes","Yes","Weekday Daytime Minutes",1]
[null,"Wednesday","2012-10-10","14:03:00",1.69,"Yes","Yes","Weekday Daytime Minutes",2]
[null,"Wednesday","2012-10-10","15:05:00",0.64,"Yes","Yes","Weekday Daytime Minutes",1]
[null,"Wednesday","2012-10-10","15:12:00",5.53,"Yes","Yes","Weekday Daytime Minutes",6]
[null,"Wednesday","2012-10-10","16:28:00",0.04,"Yes","Yes","Weekday Daytime Minutes",1]
[null,"Wednesday","2012-10-10","16:29:00",0.73,"Yes","Yes","Weekday Daytime Minutes",1]
[null,"Wednesday","2012-10-10","16:51:00",0.6,"Yes","Yes","Weekday Daytime Minutes",1]
[null,"Wednesday","2012-10-10","17:05:00",0.98,"Yes","Yes","Weekday Daytime Minutes",1]
[null,"Wednesday","2012-10-10","17:16:00",0.74,"Yes","Yes","Weekday Daytime Minutes",1]
[null,"Wednesday","2012-10-10","17:48:00",30.5,"Yes","Yes","Weekday Daytime Minutes",31]
[null,"Wednesday","2012-10-10","18:49:00",0.32,"Yes","Yes","Weekday Daytime Minutes",1]
[null,"Wednesday","2012-10-10","19:18:00",2.58,"Yes","No","Evening & Weekend Minutes",3]
[null,"Thursday","2012-10-11","11:27:00",0.43,"Yes","Yes","Weekday Daytime Minutes",1]
[null,"Thursday","2012-10-11","12:06:00",3,"Yes","Yes","Weekday Daytime Minutes",3]
[null,"Thursday","2012-10-11","13:56:00",0.84,"Yes","Yes","Weekday Daytime Minutes",1]
[null,"Thursday","2012-10-11","14:10:00",0.52,"Yes","Yes","Weekday Daytime Minutes",1]
[null,"Thursday","2012-10-11","15:13:00",1.92,"Yes","Yes","Weekday Daytime Minutes",2]
[null,"Thursday","2012-10-11","15:37:00",0.42,"Yes","Yes","Weekday Daytime Minutes",1]
[null,"Thursday","2012-10-11","15:47:00",2.44,"Yes","Yes","Weekday Daytime Minutes",3]
[null,"Thursday","2012-10-11","16:31:00",3.24,"Yes","Yes","Weekday Daytime Minutes",4]
[null,"Thursday","2012-10-11","17:44:00",1.75,"Yes","Yes","Weekday Daytime Minutes",2]
[null,"Thursday","2012-10-11","18:22:00",1.58,"Yes","Yes","Weekday Daytime Minutes",2]
[null,"Thursday","2012-10-11","19:03:00",0.9,"Yes","No","Evening & Weekend Minutes",1]
[null,"Thursday","2012-10-11","19:21:00",0.31,"Yes","No","Evening & Weekend Minutes",1]
[null,"Thursday","2012-10-11","19:31:00",1.87,"Yes","No","Evening & Weekend Minutes",2]
[null,"Thursday","2012-10-11","19:55:00",2.42,"Yes","No","Evening & Weekend Minutes",3]
[null,"Thursday","2012-10-11","20:33:00",1.85,"Yes","No","Evening & Weekend Minutes",2]
[null,"Thursday","2012-10-11","21:47:00",3.54,"Yes","No","Evening & Weekend Minutes",4]
[null,"Thursday","2012-10-11","22:33:00",1.03,"Yes","No","Evening & Weekend Minutes",2]
[null,"Thursday","2012-10-11","23:40:00",0.53,"Yes","No","Evening & Weekend Minutes",1]
[null,"Thursday","2012-10-11",1.0194444444444444,0.51,"Yes","No","Evening & Weekend Minutes",1]
[null,"Thursday","2012-10-11",1.0687499999999999,1.81,{"$f":"IF(OR(B196=\"Sunday\",B196=\"Saturday\"),\"No\",\"Yes\")","v":"Yes"},{"$f":"IF(D196<0.7916,\"Yes\",\"No\")","v":"No"},{"$f":"IF(AND(F196=\"yes\",G196=\"yes\"),\"Weekday Daytime Minutes\",\"Evening & Weekend Minutes\")","v":"Evening & Weekend Minutes"},{"$f":"ROUNDUP(E196,0)","v":2}]
[null,"Thursday","2012-10-11",1.0902777777777779,1.51,"Yes","No","Evening & Weekend Minutes",2]
[null,"Thursday","2012-10-11",1.1138888888888889,1.67,"Yes","No","Evening & Weekend Minutes",2]
[null,"Friday","2012-10-12","10:41:00",1.29,"Yes","Yes","Weekday Daytime Minutes",2]
[null,"Friday","2012-10-12","11:24:00",3.02,"Yes","Yes","Weekday Daytime Minutes",4]
[null,"Friday","2012-10-12","12:13:00",5,"Yes","Yes","Weekday Daytime Minutes",5]
[null,"Friday","2012-10-12","13:28:00",0.56999999999999995,"Yes","Yes","Weekday Daytime Minutes",1]
[null,"Friday","2012-10-12","14:08:00",5.78,"Yes","Yes","Weekday Daytime Minutes",6]
[null,"Friday","2012-10-12","15:47:00",0.21,"Yes","Yes","Weekday Daytime Minutes",1]
[null,"Friday","2012-10-12","16:06:00",3.9,"Yes","Yes","Weekday Daytime Minutes",4]
[null,"Friday","2012-10-12","17:11:00",0.32,"Yes","Yes","Weekday Daytime Minutes",1]
[null,"Friday","2012-10-12","17:26:00",4.76,"Yes","Yes","Weekday Daytime Minutes",5]
[null,"Friday","2012-10-12","18:34:00",1.68,"Yes","Yes","Weekday Daytime Minutes",2]
[null,"Friday","2012-10-12","18:58:00",2.69,"Yes","Yes","Weekday Daytime Minutes",3]
[null,"Friday","2012-10-12","19:35:00",3.32,"Yes","No","Evening & Weekend Minutes",4]
[null,"Friday","2012-10-12","20:23:00",1.72,"Yes","No","Evening & Weekend Minutes",2]
[null,"Friday","2012-10-12","20:46:00",1.29,"Yes","No","Evening & Weekend Minutes",2]
[null,"Friday","2012-10-12","21:17:00",0.72,"Yes","No","Evening & Weekend Minutes",1]
[null,"Friday","2012-10-12","22:29:00",1.45,"Yes","No","Evening & Weekend Minutes",2]
[null,"Friday","2012-10-12","22:56:00",1.54,"Yes","No","Evening & Weekend Minutes",2]
[null,"Friday","2012-10-12","23:16:00",1.5,"Yes","No","Evening & Weekend Minutes",2]
[null,"Friday","2012-10-12",1.0180555555555555,1.67,"Yes","No","Evening & Weekend Minutes",2]
[null,"Saturday","2012-10-13","09:10:00",1.8,"No","Yes","Evening & Weekend Minutes",2]
[null,"Saturday","2012-10-13","09:38:00",1.54,"No","Yes","Evening & Weekend Minutes",2]
[null,"Saturday","2012-10-13","10:05:00",0.73,"No","Yes","Evening & Weekend Minutes",1]
[null,"Saturday","2012-10-13","10:27:00",0.95,"No","Yes","Evening & Weekend Minutes",1]
[null,"Saturday","2012-10-13","11:29:00",7.0000000000000007E-2,"No","Yes","Evening & Weekend Minutes",1]
[null,"Saturday","2012-10-13","11:30:00",41.33,"No","Yes","Evening & Weekend Minutes",42]
[null,"Saturday","2012-10-13","12:32:00",0.82,"No","Yes","Evening & Weekend Minutes",1]
[null,"Saturday","2012-10-13","12:50:00",0.24,"No","Yes","Evening & Weekend Minutes",1]
[null,"Saturday","2012-10-13","13:03:00",2.31,"No","Yes","Evening & Weekend Minutes",3]
[null,"Saturday","2012-10-13","13:57:00",0.86,"No","Yes","Evening & Weekend Minutes",1]
[null,"Saturday","2012-10-13","14:09:00",3.75,"No","Yes","Evening & Weekend Minutes",4]
[null,"Saturday","2012-10-13","15:24:00",31.5,"No","Yes","Evening & Weekend Minutes",32]
[null,"Saturday","2012-10-13","16:27:00",2.2200000000000002,"No","Yes","Evening & Weekend Minutes",3]
[null,"Saturday","2012-10-13","17:07:00",2.95,"No","Yes","Evening & Weekend Minutes",3]
[null,"Saturday","2012-10-13","18:01:00",4.29,"No","Yes","Evening & Weekend Minutes",5]
[null,"Saturday","2012-10-13","19:34:00",0.62,"No","No","Evening & Weekend Minutes",1]
[null,"Saturday","2012-10-13","19:42:00",2.23,"No","No","Evening & Weekend Minutes",3]
[null,"Sunday","2012-10-14","08:21:00",5.27,"No","Yes","Evening & Weekend Minutes",6]
[null,"Sunday","2012-10-14","09:40:00",1.53,"No","Yes","Evening & Weekend Minutes",2]
[null,"Sunday","2012-10-14","10:01:00",2.3199999999999998,"No","Yes","Evening & Weekend Minutes",3]
[null,"Sunday","2012-10-14","10:30:00",0.86,"No","Yes","Evening & Weekend Minutes",1]
[null,"Sunday","2012-10-14","10:30:00",0.16,"No","Yes","Evening & Weekend Minutes",1]
[null,"Sunday","2012-10-14","10:37:00",1.6,"No","Yes","Evening & Weekend Minutes",2]
[null,"Sunday","2012-10-14","10:53:00",1.34,"No","Yes","Evening & Weekend Minutes",2]
[null,"Sunday","2012-10-14","11:14:00",0.67,"No","Yes","Evening & Weekend Minutes",1]
[null,"Sunday","2012-10-14","11:26:00",0.51,"No","Yes","Evening & Weekend Minutes",1]
[null,"Sunday","2012-10-14","11:49:00",0.31,"No","Yes","Evening & Weekend Minutes",1]
[null,"Sunday","2012-10-14","12:06:00",1.41,"No","Yes","Evening & Weekend Minutes",2]
[null,"Sunday","2012-10-14","13:45:00",0.17,"No","Yes","Evening & Weekend Minutes",1]
[null,"Sunday","2012-10-14","14:02:00",1.05,"No","Yes","Evening & Weekend Minutes",2]
[null,"Sunday","2012-10-14","15:05:00",0.68,"No","Yes","Evening & Weekend Minutes",1]
[null,"Sunday","2012-10-14","15:27:00",0.5,"No","Yes","Evening & Weekend Minutes",1]
[null,"Sunday","2012-10-14","15:39:00",1.69,"No","Yes","Evening & Weekend Minutes",2]
[null,"Sunday","2012-10-14","16:55:00",0.59,"No","Yes","Evening & Weekend Minutes",1]
[null,"Sunday","2012-10-14","17:06:00",2.48,"No","Yes","Evening & Weekend Minutes",3]
[null,"Sunday","2012-10-14","17:37:00",0.54,"No","Yes","Evening & Weekend Minutes",1]
[null,"Sunday","2012-10-14","17:56:00",0.06,"No","Yes","Evening & Weekend Minutes",1]
[null,"Sunday","2012-10-14","17:57:00",1.17,"No","Yes","Evening & Weekend Minutes",2]
[null,"Monday","2012-10-15","11:12:00",3.71,"Yes","Yes","Weekday Daytime Minutes",4]
[null,"Monday","2012-10-15","12:17:00",0.09,"Yes","Yes","Weekday Daytime Minutes",1]
[null,"Monday","2012-10-15","12:20:00",3.8,"Yes","Yes","Weekday Daytime Minutes",4]
[null,"Monday","2012-10-15","12:58:00",5.49,"Yes","Yes","Weekday Daytime Minutes",6]
[null,"Monday","2012-10-15","13:59:00",0.1,{"$f":"IF(OR(B260=\"Sunday\",B260=\"Saturday\"),\"No\",\"Yes\")","v":"Yes"},{"$f":"IF(D260<0.7916,\"Yes\",\"No\")","v":"Yes"},{"$f":"IF(AND(F260=\"yes\",G260=\"yes\"),\"Weekday Daytime Minutes\",\"Evening & Weekend Minutes\")","v":"Weekday Daytime Minutes"},{"$f":"ROUNDUP(E260,0)","v":1}]
[null,"Monday","2012-10-15","14:01:00",0.21,"Yes","Yes","Weekday Daytime Minutes",1]
[null,"Monday","2012-10-15","14:30:00",1.4,"Yes","Yes","Weekday Daytime Minutes",2]
[null,"Monday","2012-10-15","14:56:00",1.47,"Yes","Yes","Weekday Daytime Minutes",2]
[null,"Monday","2012-10-15","15:18:00",0.34,"Yes","Yes","Weekday Daytime Minutes",1]
[null,"Monday","2012-10-15","15:49:00",1.0900000000000001,"Yes","Yes","Weekday Daytime Minutes",2]
[null,"Tuesday","2012-10-16","10:02:00",1.64,"Yes","Yes","Weekday Daytime Minutes",2]
[null,"Tuesday","2012-10-16","11:24:00",0.08,"Yes","Yes","Weekday Daytime Minutes",1]
[null,"Tuesday","2012-10-16","11:26:00",1.23,"Yes","Yes","Weekday Daytime Minutes",2]
[null,"Tuesday","2012-10-16","12:11:00",0.49,"Yes","Yes","Weekday Daytime Minutes",1]
[null,"Tuesday","2012-10-16","13:19:00",0.38,"Yes","Yes","Weekday Daytime Minutes",1]
[null,"Tuesday","2012-10-16","14:08:00",62.16,"Yes","Yes","Weekday Daytime Minutes",63]
[null,"Tuesday","2012-10-16","15:59:00",2.38,"Yes","Yes","Weekday Daytime Minutes",3]
[null,"Tuesday","2012-10-16","16:36:00",0.42,"Yes","Yes","Weekday Daytime Minutes",1]
[null,"Tuesday","2012-10-16","17:22:00",1.23,"Yes","Yes","Weekday Daytime Minutes",2]
[null,"Tuesday","2012-10-16","17:38:00",0.52,"Yes","Yes","Weekday Daytime Minutes",1]
[null,"Tuesday","2012-10-16","18:12:00",0.42,"Yes","Yes","Weekday Daytime Minutes",1]
[null,"Tuesday","2012-10-16","18:26:00",0.01,"Yes","Yes","Weekday Daytime Minutes",1]
[null,"Tuesday","2012-10-16","18:27:00",1.91,"Yes","Yes","Weekday Daytime Minutes",2]
[null,"Tuesday","2012-10-16","18:48:00",1.1200000000000001,"Yes","Yes","Weekday Daytime Minutes",2]
[null,"Tuesday","2012-10-16","19:04:00",2.7,"Yes","No","Evening & Weekend Minutes",3]
[null,"Tuesday","2012-10-16","19:37:00",0.56999999999999995,"Yes","No","Evening & Weekend Minutes",1]
[null,"Tuesday","2012-10-16","20:45:00",1.1100000000000001,"Yes","No","Evening & Weekend Minutes",2]
[null,"Tuesday","2012-10-16","21:09:00",0.1,"Yes","No","Evening & Weekend Minutes",1]
[null,"Tuesday","2012-10-16","21:22:00",3.24,"Yes","No","Evening & Weekend Minutes",4]
[null,"Tuesday","2012-10-16","22:16:00",3.2,"Yes","No","Evening & Weekend Minutes",4]
[null,"Wednesday","2012-10-17","11:21:00",1.17,"Yes","Yes","Weekday Daytime Minutes",2]
[null,"Wednesday","2012-10-17","12:02:00",3.82,"Yes","Yes","Weekday Daytime Minutes",4]
[null,"Wednesday","2012-10-17","13:04:00",0.18,"Yes","Yes","Weekday Daytime Minutes",1]
[null,"Wednesday","2012-10-17","13:08:00",1.08,"Yes","Yes","Weekday Daytime Minutes",2]
[null,"Wednesday","2012-10-17","13:21:00",0.09,"Yes","Yes","Weekday Daytime Minutes",1]
[null,"Wednesday","2012-10-17","13:24:00",0.49,"Yes","Yes","Weekday Daytime Minutes",1]
[null,"Wednesday","2012-10-17","13:32:00",0.04,"Yes","Yes","Weekday Daytime Minutes",1]
[null,"Wednesday","2012-10-17","13:34:00",0.54,"Yes","Yes","Weekday Daytime Minutes",1]
[null,"Wednesday","2012-10-17","13:41:00",0.05,"Yes","Yes","Weekday Daytime Minutes",1]
[null,"Wednesday","2012-10-17","13:43:00",0.4,"Yes","Yes","Weekday Daytime Minutes",1]
[null,"Wednesday","2012-10-17","13:48:00",0.09,"Yes","Yes","Weekday Daytime Minutes",1]
[null,"Wednesday","2012-10-17","13:50:00",0.13,"Yes","Yes","Weekday Daytime Minutes",1]
[null,"Wednesday","2012-10-17","13:54:00",4.0599999999999996,"Yes","Yes","Weekday Daytime Minutes",5]
[null,"Wednesday","2012-10-17","14:52:00",5.33,"Yes","Yes","Weekday Daytime Minutes",6]
[null,"Wednesday","2012-10-17","15:52:00",1.54,"Yes","Yes","Weekday Daytime Minutes",2]
[null,"Thursday","2012-10-18","12:23:00",3.68,"Yes","Yes","Weekday Daytime Minutes",4]
[null,"Thursday","2012-10-18","13:55:00",0.44,"Yes","Yes","Weekday Daytime Minutes",1]
[null,"Thursday","2012-10-18","13:55:00",0.11,"Yes","Yes","Weekday Daytime Minutes",1]
[null,"Thursday","2012-10-18","14:00:00",2.63,"Yes","Yes","Weekday Daytime Minutes",3]
[null,"Thursday","2012-10-18","15:19:00",6,"Yes","Yes","Weekday Daytime Minutes",6]
[null,"Thursday","2012-10-18","16:34:00",4.8,"Yes","Yes","Weekday Daytime Minutes",5]
[null,"Thursday","2012-10-18","17:54:00",0.32,"Yes","Yes","Weekday Daytime Minutes",1]
[null,"Thursday","2012-10-18","18:09:00",0.06,"Yes","Yes","Weekday Daytime Minutes",1]
[null,"Thursday","2012-10-18","18:18:00",2.5,"Yes","Yes","Weekday Daytime Minutes",3]
[null,"Thursday","2012-10-18","18:48:00",0.54,"Yes","Yes","Weekday Daytime Minutes",1]
[null,"Thursday","2012-10-18","18:58:00",3.64,"Yes","Yes","Weekday Daytime Minutes",4]
[null,"Thursday","2012-10-18","19:39:00",0.55000000000000004,"Yes","No","Evening & Weekend Minutes",1]
[null,"Thursday","2012-10-18","20:01:00",0.51,"Yes","No","Evening & Weekend Minutes",1]
[null,"Thursday","2012-10-18","20:23:00",2.34,"Yes","No","Evening & Weekend Minutes",3]
[null,"Thursday","2012-10-18","21:01:00",1.1200000000000001,"Yes","No","Evening & Weekend Minutes",2]
[null,"Thursday","2012-10-18","22:53:00",0.15,"Yes","No","Evening & Weekend Minutes",1]
[null,"Thursday","2012-10-18","23:08:00",0.64,"Yes","No","Evening & Weekend Minutes",1]
[null,"Thursday","2012-10-18","23:23:00",1.05,"Yes","No","Evening & Weekend Minutes",2]
[null,"Thursday","2012-10-18","23:46:00",1,"Yes","No","Evening & Weekend Minutes",1]
[null,"Thursday","2012-10-18","23:58:00",0.93,"Yes","No","Evening & Weekend Minutes",1]
[null,"Thursday","2012-10-18",1.0180555555555555,1.2,"Yes","No","Evening & Weekend Minutes",2]
[null,"Friday","2012-10-19","08:29:00",1.74,"Yes","Yes","Weekday Daytime Minutes",2]
[null,"Friday","2012-10-19","09:56:00",1.7,"Yes","Yes","Weekday Daytime Minutes",2]
[null,"Friday","2012-10-19","10:47:00",0.84,{"$f":"IF(OR(B324=\"Sunday\",B324=\"Saturday\"),\"No\",\"Yes\")","v":"Yes"},{"$f":"IF(D324<0.7916,\"Yes\",\"No\")","v":"Yes"},{"$f":"IF(AND(F324=\"yes\",G324=\"yes\"),\"Weekday Daytime Minutes\",\"Evening & Weekend Minutes\")","v":"Weekday Daytime Minutes"},{"$f":"ROUNDUP(E324,0)","v":1}]
[null,"Friday","2012-10-19","11:15:00",0.4,"Yes","Yes","Weekday Daytime Minutes",1]
[null,"Friday","2012-10-19","11:20:00",7.0000000000000007E-2,"Yes","Yes","Weekday Daytime Minutes",1]
[null,"Friday","2012-10-19","11:23:00",2.33,"Yes","Yes","Weekday Daytime Minutes",3]
[null,"Friday","2012-10-19","12:27:00",0.9,"Yes","Yes","Weekday Daytime Minutes",1]
[null,"Friday","2012-10-19","12:45:00",0.09,"Yes","Yes","Weekday Daytime Minutes",1]
[null,"Friday","2012-10-19","12:47:00",0.72,"Yes","Yes","Weekday Daytime Minutes",1]
[null,"Friday","2012-10-19","13:00:00",0.01,"Yes","Yes","Weekday Daytime Minutes",1]
[null,"Friday","2012-10-19","13:01:00",0.51,"Yes","Yes","Weekday Daytime Minutes",1]
[null,"Friday","2012-10-19","13:15:00",2.0499999999999998,"Yes","Yes","Weekday Daytime Minutes",3]
[null,"Friday","2012-10-19","13:40:00",2.08,"Yes","Yes","Weekday Daytime Minutes",3]
[null,"Friday","2012-10-19","14:25:00",7.0000000000000007E-2,"Yes","Yes","Weekday Daytime Minutes",1]
[null,"Friday","2012-10-19","14:26:00",0.35,"Yes","Yes","Weekday Daytime Minutes",1]
[null,"Friday","2012-10-19","14:33:00",4.6900000000000004,"Yes","Yes","Weekday Daytime Minutes",5]
[null,"Friday","2012-10-19","15:40:00",0.72,"Yes","Yes","Weekday Daytime Minutes",1]
[null,"Friday","2012-10-19","15:52:00",2.64,"Yes","Yes","Weekday Daytime Minutes",3]
[null,"Friday","2012-10-19","16:33:00",3.67,"Yes","Yes","Weekday Daytime Minutes",4]
[null,"Saturday","2012-10-20","10:02:00",0.37,"No","Yes","Evening & Weekend Minutes",1]
[null,"Saturday","2012-10-20","10:08:00",0.82,"No","Yes","Evening & Weekend Minutes",1]
[null,"Saturday","2012-10-20","10:22:00",3.62,"No","Yes","Evening & Weekend Minutes",4]
[null,"Saturday","2012-10-20","11:09:00",1.96,"No","Yes","Evening & Weekend Minutes",2]
[null,"Saturday","2012-10-20","11:33:00",0.28999999999999998,"No","Yes","Evening & Weekend Minutes",1]
[null,"Saturday","2012-10-20","11:52:00",2.5,"No","Yes","Evening & Weekend Minutes",3]
[null,"Saturday","2012-10-20","12:17:00",1.96,"No","Yes","Evening & Weekend Minutes",2]
[null,"Saturday","2012-10-20","12:41:00",1.17,"No","Yes","Evening & Weekend Minutes",2]
[null,"Saturday","2012-10-20","13:02:00",1.4,"No","Yes","Evening & Weekend Minutes",2]
[null,"Saturday","2012-10-20","13:30:00",0.37,"No","Yes","Evening & Weekend Minutes",1]
[null,"Saturday","2012-10-20","14:18:00",2.2400000000000002,"No","Yes","Evening & Weekend Minutes",3]
[null,"Saturday","2012-10-20","14:50:00",3.19,"No","Yes","Evening & Weekend Minutes",4]
[null,"Saturday","2012-10-20","15:29:00",1.32,"No","Yes","Evening & Weekend Minutes",2]
[null,"Saturday","2012-10-20","16:02:00",2.5299999999999998,"No","Yes","Evening & Weekend Minutes",3]
[null,"Saturday","2012-10-20","16:59:00",0.28000000000000003,"No","Yes","Evening & Weekend Minutes",1]
[null,"Saturday","2012-10-20","17:16:00",0.54,"No","Yes","Evening & Weekend Minutes",1]
[null,"Saturday","2012-10-20","17:25:00",1.21,"No","Yes","Evening & Weekend Minutes",2]
[null,"Saturday","2012-10-20","17:42:00",0.33,"No","Yes","Evening & Weekend Minutes",1]
[null,"Saturday","2012-10-20","17:52:00",0.3,"No","Yes","Evening & Weekend Minutes",1]
[null,"Saturday","2012-10-20","17:55:00",0.12,"No","Yes","Evening & Weekend Minutes",1]
[null,"Saturday","2012-10-20","18:11:00",71.28,"No","Yes","Evening & Weekend Minutes",72]
[null,"Saturday","2012-10-20","19:50:00",1.21,"No","No","Evening & Weekend Minutes",2]
[null,"Sunday","2012-10-21","10:06:00",0.43,"No","Yes","Evening & Weekend Minutes",1]
[null,"Sunday","2012-10-21","10:16:00",0.02,"No","Yes","Evening & Weekend Minutes",1]
[null,"Sunday","2012-10-21","10:17:00",4.91,"No","Yes","Evening & Weekend Minutes",5]
[null,"Sunday","2012-10-21","11:11:00",1.41,"No","Yes","Evening & Weekend Minutes",2]
[null,"Sunday","2012-10-21","12:12:00",58.26,"No","Yes","Evening & Weekend Minutes",59]
[null,"Sunday","2012-10-21","13:59:00",3.55,"No","Yes","Evening & Weekend Minutes",4]
[null,"Sunday","2012-10-21","14:38:00",0.33,"No","Yes","Evening & Weekend Minutes",1]
[null,"Sunday","2012-10-21","14:43:00",5.92,"No","Yes","Evening & Weekend Minutes",6]
[null,"Sunday","2012-10-21","15:54:00",0.35,"No","Yes","Evening & Weekend Minutes",1]
[null,"Sunday","2012-10-21","16:01:00",5.75,"No","Yes","Evening & Weekend Minutes",6]
[null,"Sunday","2012-10-21","17:10:00",0.45,"No","Yes","Evening & Weekend Minutes",1]
[null,"Sunday","2012-10-21","17:59:00",0.88,"No","Yes","Evening & Weekend Minutes",1]
[null,"Sunday","2012-10-21","18:52:00",2.38,"No","Yes","Evening & Weekend Minutes",3]
[null,"Monday","2012-10-22","09:01:00",0.42,"Yes","Yes","Weekday Daytime Minutes",1]
[null,"Monday","2012-10-22","09:11:00",0.04,"Yes","Yes","Weekday Daytime Minutes",1]
[null,"Monday","2012-10-22","09:15:00",0.46,"Yes","Yes","Weekday Daytime Minutes",1]
[null,"Monday","2012-10-22","09:21:00",1.25,"Yes","Yes","Weekday Daytime Minutes",2]
[null,"Monday","2012-10-22","09:46:00",0.47,"Yes","Yes","Weekday Daytime Minutes",1]
[null,"Monday","2012-10-22","09:59:00",0.51,"Yes","Yes","Weekday Daytime Minutes",1]
[null,"Monday","2012-10-22","10:10:00",0.88,"Yes","Yes","Weekday Daytime Minutes",1]
[null,"Monday","2012-10-22","10:54:00",0.63,"Yes","Yes","Weekday Daytime Minutes",1]
[null,"Monday","2012-10-22","11:13:00",0.72,"Yes","Yes","Weekday Daytime Minutes",1]
[null,"Monday","2012-10-22","12:00:00",2.94,"Yes","Yes","Weekday Daytime Minutes",3]
[null,"Monday","2012-10-22","13:38:00",4.57,"Yes","Yes","Weekday Daytime Minutes",5]
[null,"Monday","2012-10-22","14:42:00",1.32,"Yes","Yes","Weekday Daytime Minutes",2]
[null,"Monday","2012-10-22","15:01:00",0.8,{"$f":"IF(OR(B388=\"Sunday\",B388=\"Saturday\"),\"No\",\"Yes\")","v":"Yes"},{"$f":"IF(D388<0.7916,\"Yes\",\"No\")","v":"Yes"},{"$f":"IF(AND(F388=\"yes\",G388=\"yes\"),\"Weekday Daytime Minutes\",\"Evening & Weekend Minutes\")","v":"Weekday Daytime Minutes"},{"$f":"ROUNDUP(E388,0)","v":1}]
[null,"Monday","2012-10-22","15:14:00",1.78,"Yes","Yes","Weekday Daytime Minutes",2]
[null,"Monday","2012-10-22","15:30:00",4.45,"Yes","Yes","Weekday Daytime Minutes",5]
[null,"Monday","2012-10-22","16:19:00",0.56000000000000005,"Yes","Yes","Weekday Daytime Minutes",1]
[null,"Monday","2012-10-22","17:38:00",2.14,"Yes","Yes","Weekday Daytime Minutes",3]
[null,"Monday","2012-10-22","18:25:00",3.66,"Yes","Yes","Weekday Daytime Minutes",4]
[null,"Monday","2012-10-22","19:12:00",0.15,"Yes","No","Evening & Weekend Minutes",1]
[null,"Monday","2012-10-22","19:28:00",0.09,"Yes","No","Evening & Weekend Minutes",1]
[null,"Monday","2012-10-22","19:29:00",0.64,"Yes","No","Evening & Weekend Minutes",1]
[null,"Tuesday","2012-10-23","09:11:00",3.06,"Yes","Yes","Weekday Daytime Minutes",4]
[null,"Tuesday","2012-10-23","10:06:00",1.2,"Yes","Yes","Weekday Daytime Minutes",2]
[null,"Tuesday","2012-10-23","10:48:00",0.55000000000000004,"Yes","Yes","Weekday Daytime Minutes",1]
[null,"Tuesday","2012-10-23","11:00:00",0.78,"Yes","Yes","Weekday Daytime Minutes",1]
[null,"Tuesday","2012-10-23","11:17:00",0.06,"Yes","Yes","Weekday Daytime Minutes",1]
[null,"Tuesday","2012-10-23","11:18:00",1.38,"Yes","Yes","Weekday Daytime Minutes",2]
[null,"Tuesday","2012-10-23","11:38:00",0.05,"Yes","Yes","Weekday Daytime Minutes",1]
[null,"Tuesday","2012-10-23","11:39:00",0.26,"Yes","Yes","Weekday Daytime Minutes",1]
[null,"Tuesday","2012-10-23","11:48:00",2.1,"Yes","Yes","Weekday Daytime Minutes",3]
[null,"Tuesday","2012-10-23","12:30:00",5.92,"Yes","Yes","Weekday Daytime Minutes",6]
[null,"Tuesday","2012-10-23","13:44:00",0.13,"Yes","Yes","Weekday Daytime Minutes",1]
[null,"Tuesday","2012-10-23","14:01:00",2.78,"Yes","Yes","Weekday Daytime Minutes",3]
[null,"Tuesday","2012-10-23","15:43:00",1.2,"Yes","Yes","Weekday Daytime Minutes",2]
[null,"Tuesday","2012-10-23","16:25:00",0.28999999999999998,"Yes","Yes","Weekday Daytime Minutes",1]
[null,"Tuesday","2012-10-23","16:51:00",2.4,"Yes","Yes","Weekday Daytime Minutes",3]
[null,"Tuesday","2012-10-23","17:15:00",3,"Yes","Yes","Weekday Daytime Minutes",3]
[null,"Tuesday","2012-10-23","18:45:00",0.18,"Yes","Yes","Weekday Daytime Minutes",1]
[null,"Tuesday","2012-10-23","18:47:00",0.11,"Yes","Yes","Weekday Daytime Minutes",1]
[null,"Tuesday","2012-10-23","18:50:00",0.71,"Yes","Yes","Weekday Daytime Minutes",1]
[null,"Tuesday","2012-10-23","19:06:00",1.55,"Yes","No","Evening & Weekend Minutes",2]
[null,"Tuesday","2012-10-23","19:37:00",2.11,"Yes","No","Evening & Weekend Minutes",3]
[null,"Wednesday","2012-10-24","11:42:00",1.62,"Yes","Yes","Weekday Daytime Minutes",2]
[null,"Wednesday","2012-10-24","12:24:00",0.2,"Yes","Yes","Weekday Daytime Minutes",1]
[null,"Wednesday","2012-10-24","12:27:00",0.14000000000000001,"Yes","Yes","Weekday Daytime Minutes",1]
[null,"Wednesday","2012-10-24","12:30:00",0.73,"Yes","Yes","Weekday Daytime Minutes",1]
[null,"Wednesday","2012-10-24","13:21:00",1.78,"Yes","Yes","Weekday Daytime Minutes",2]
[null,"Wednesday","2012-10-24","13:41:00",1.64,"Yes","Yes","Weekday Daytime Minutes",2]
[null,"Wednesday","2012-10-24","14:18:00",2.95,"Yes","Yes","Weekday Daytime Minutes",3]
[null,"Wednesday","2012-10-24","15:23:00",0.93,"Yes","Yes","Weekday Daytime Minutes",1]
[null,"Wednesday","2012-10-24","16:19:00",2.04,"Yes","Yes","Weekday Daytime Minutes",3]
[null,"Wednesday","2012-10-24","16:42:00",2.29,"Yes","Yes","Weekday Daytime Minutes",3]
[null,"Wednesday","2012-10-24","17:37:00",0.56000000000000005,"Yes","Yes","Weekday Daytime Minutes",1]
[null,"Wednesday","2012-10-24","18:16:00",0.18,"Yes","Yes","Weekday Daytime Minutes",1]
[null,"Wednesday","2012-10-24","18:20:00",0.22,"Yes","Yes","Weekday Daytime Minutes",1]
[null,"Wednesday","2012-10-24","18:24:00",1.02,"Yes","Yes","Weekday Daytime Minutes",2]
[null,"Wednesday","2012-10-24","18:52:00",0.97,"Yes","Yes","Weekday Daytime Minutes",1]
[null,"Wednesday","2012-10-24","19:34:00",5.21,"Yes","No","Evening & Weekend Minutes",6]
[null,"Wednesday","2012-10-24","20:41:00",0.28999999999999998,"Yes","No","Evening & Weekend Minutes",1]
[null,"Wednesday","2012-10-24","21:13:00",0.17,"Yes","No","Evening & Weekend Minutes",1]
[null,"Wednesday","2012-10-24","21:25:00",1.75,"Yes","No","Evening & Weekend Minutes",2]
[null,"Wednesday","2012-10-24","21:50:00",1.5,"Yes","No","Evening & Weekend Minutes",2]
[null,"Wednesday","2012-10-24","22:45:00",1.8,"Yes","No","Evening & Weekend Minutes",2]
[null,"Wednesday","2012-10-24","23:57:00",0.57999999999999996,"Yes","No","Evening & Weekend Minutes",1]
[null,"Thursday","2012-10-25","10:06:00",1.1399999999999999,"Yes","Yes","Weekday Daytime Minutes",2]
[null,"Thursday","2012-10-25","11:20:00",0.12,"Yes","Yes","Weekday Daytime Minutes",1]
[null,"Thursday","2012-10-25","11:28:00",0.56999999999999995,"Yes","Yes","Weekday Daytime Minutes",1]
[null,"Thursday","2012-10-25","11:45:00",0.89,"Yes","Yes","Weekday Daytime Minutes",1]
[null,"Thursday","2012-10-25","12:34:00",0.9,"Yes","Yes","Weekday Daytime Minutes",1]
[null,"Thursday","2012-10-25","12:52:00",2.27,"Yes","Yes","Weekday Daytime Minutes",3]
[null,"Thursday","2012-10-25","13:26:00",0.27,"Yes","Yes","Weekday Daytime Minutes",1]
[null,"Thursday","2012-10-25","13:30:00",55.33,"Yes","Yes","Weekday Daytime Minutes",56]
[null,"Thursday","2012-10-25","14:53:00",0.87,"Yes","Yes","Weekday Daytime Minutes",1]
[null,"Thursday","2012-10-25","15:08:00",1,"Yes","Yes","Weekday Daytime Minutes",1]
[null,"Thursday","2012-10-25","15:33:00",0.05,"Yes","Yes","Weekday Daytime Minutes",1]
[null,"Thursday","2012-10-25","15:39:00",2,"Yes","Yes","Weekday Daytime Minutes",2]
[null,"Thursday","2012-10-25","16:03:00",0.89,{"$f":"IF(OR(B452=\"Sunday\",B452=\"Saturday\"),\"No\",\"Yes\")","v":"Yes"},{"$f":"IF(D452<0.7916,\"Yes\",\"No\")","v":"Yes"},{"$f":"IF(AND(F452=\"yes\",G452=\"yes\"),\"Weekday Daytime Minutes\",\"Evening & Weekend Minutes\")","v":"Weekday Daytime Minutes"},{"$f":"ROUNDUP(E452,0)","v":1}]
[null,"Thursday","2012-10-25","16:13:00",0.25,"Yes","Yes","Weekday Daytime Minutes",1]
[null,"Thursday","2012-10-25","16:20:00",0.97,"Yes","Yes","Weekday Daytime Minutes",1]
[null,"Thursday","2012-10-25","16:49:00",7.0000000000000007E-2,"Yes","Yes","Weekday Daytime Minutes",1]
[null,"Thursday","2012-10-25","16:50:00",1.36,"Yes","Yes","Weekday Daytime Minutes",2]
[null,"Thursday","2012-10-25","17:07:00",3.5,"Yes","Yes","Weekday Daytime Minutes",4]
[null,"Thursday","2012-10-25","17:57:00",1.33,"Yes","Yes","Weekday Daytime Minutes",2]
[null,"Friday","2012-10-26","11:32:00",0.17,"Yes","Yes","Weekday Daytime Minutes",1]
[null,"Friday","2012-10-26","11:36:00",0.62,"Yes","Yes","Weekday Daytime Minutes",1]
[null,"Friday","2012-10-26","11:44:00",1.84,"Yes","Yes","Weekday Daytime Minutes",2]
[null,"Friday","2012-10-26","12:30:00",54.83,"Yes","Yes","Weekday Daytime Minutes",55]
[null,"Friday","2012-10-26","13:58:00",1.31,"Yes","Yes","Weekday Daytime Minutes",2]
[null,"Friday","2012-10-26","14:34:00",3.85,"Yes","Yes","Weekday Daytime Minutes",4]
[null,"Friday","2012-10-26","15:21:00",1.64,"Yes","Yes","Weekday Daytime Minutes",2]
[null,"Friday","2012-10-26","16:02:00",0.53,"Yes","Yes","Weekday Daytime Minutes",1]
[null,"Friday","2012-10-26","16:18:00",0.08,"Yes","Yes","Weekday Daytime Minutes",1]
[null,"Friday","2012-10-26","16:19:00",0.13,"Yes","Yes","Weekday Daytime Minutes",1]
[null,"Friday","2012-10-26","16:23:00",0.36,"Yes","Yes","Weekday Daytime Minutes",1]
[null,"Friday","2012-10-26","16:27:00",5.33,"Yes","Yes","Weekday Daytime Minutes",6]
[null,"Friday","2012-10-26","17:15:00",4.74,"Yes","Yes","Weekday Daytime Minutes",5]
[null,"Friday","2012-10-26","18:34:00",0.67,"Yes","Yes","Weekday Daytime Minutes",1]
[null,"Friday","2012-10-26","19:48:00",1.73,"Yes","No","Evening & Weekend Minutes",2]
[null,"Friday","2012-10-26","20:40:00",0.49,"Yes","No","Evening & Weekend Minutes",1]
[null,"Friday","2012-10-26","20:47:00",3.15,"Yes","No","Evening & Weekend Minutes",4]
[null,"Friday","2012-10-26","21:29:00",1.0900000000000001,"Yes","No","Evening & Weekend Minutes",2]
[null,"Friday","2012-10-26","21:49:00",1.64,"Yes","No","Evening & Weekend Minutes",2]
[null,"Saturday","2012-10-27","10:48:00",1.06,"No","Yes","Evening & Weekend Minutes",2]
[null,"Saturday","2012-10-27","11:01:00",0.06,"No","Yes","Evening & Weekend Minutes",1]
[null,"Saturday","2012-10-27","11:09:00",0.8,"No","Yes","Evening & Weekend Minutes",1]
[null,"Saturday","2012-10-27","11:29:00",0.24,"No","Yes","Evening & Weekend Minutes",1]
[null,"Saturday","2012-10-27","11:41:00",1.92,"No","Yes","Evening & Weekend Minutes",2]
[null,"Saturday","2012-10-27","12:29:00",0.48,"No","Yes","Evening & Weekend Minutes",1]
[null,"Saturday","2012-10-27","12:37:00",1.07,"No","Yes","Evening & Weekend Minutes",2]
[null,"Saturday","2012-10-27","13:01:00",5.55,"No","Yes","Evening & Weekend Minutes",6]
[null,"Saturday","2012-10-27","14:44:00",2.2000000000000002,"No","Yes","Evening & Weekend Minutes",3]
[null,"Saturday","2012-10-27","15:06:00",3.75,"No","Yes","Evening & Weekend Minutes",4]
[null,"Saturday","2012-10-27","15:51:00",1.17,"No","Yes","Evening & Weekend Minutes",2]
[null,"Saturday","2012-10-27","15:51:00",5.4,"No","Yes","Evening & Weekend Minutes",6]
[null,"Saturday","2012-10-27","16:45:00",0.36,"No","Yes","Evening & Weekend Minutes",1]
[null,"Saturday","2012-10-27","16:49:00",1.67,"No","Yes","Evening & Weekend Minutes",2]
[null,"Sunday","2012-10-28","11:26:00",0.72,"No","Yes","Evening & Weekend Minutes",1]
[null,"Sunday","2012-10-28","11:50:00",0.15,"No","Yes","Evening & Weekend Minutes",1]
[null,"Sunday","2012-10-28","12:00:00",0.75,"No","Yes","Evening & Weekend Minutes",1]
[null,"Sunday","2012-10-28","12:00:00",0.26,"No","Yes","Evening & Weekend Minutes",1]
[null,"Sunday","2012-10-28","12:12:00",1.73,"No","Yes","Evening & Weekend Minutes",2]
[null,"Sunday","2012-10-28","12:35:00",0.67,"No","Yes","Evening & Weekend Minutes",1]
[null,"Sunday","2012-10-28","12:51:00",2.73,"No","Yes","Evening & Weekend Minutes",3]
[null,"Sunday","2012-10-28","13:32:00",0.11,"No","Yes","Evening & Weekend Minutes",1]
[null,"Sunday","2012-10-28","13:35:00",0.3,"No","Yes","Evening & Weekend Minutes",1]
[null,"Sunday","2012-10-28","13:41:00",43.3,"No","Yes","Evening & Weekend Minutes",44]
[null,"Sunday","2012-10-28","14:38:00",1.23,"No","Yes","Evening & Weekend Minutes",2]
[null,"Sunday","2012-10-28","14:59:00",0.09,"No","Yes","Evening & Weekend Minutes",1]
[null,"Sunday","2012-10-28","15:05:00",2.72,"No","Yes","Evening & Weekend Minutes",3]
[null,"Sunday","2012-10-28","15:40:00",0.51,"No","Yes","Evening & Weekend Minutes",1]
[null,"Sunday","2012-10-28","15:52:00",2.1800000000000002,"No","Yes","Evening & Weekend Minutes",3]
[null,"Sunday","2012-10-28","16:16:00",5.17,"No","Yes","Evening & Weekend Minutes",6]
[null,"Sunday","2012-10-28","17:40:00",1.86,"No","Yes","Evening & Weekend Minutes",2]
[null,"Sunday","2012-10-28","18:11:00",0.73,"No","Yes","Evening & Weekend Minutes",1]
[null,"Sunday","2012-10-28","18:22:00",0.66,"No","Yes","Evening & Weekend Minutes",1]
[null,"Sunday","2012-10-28","18:55:00",4.34,"No","Yes","Evening & Weekend Minutes",5]
[null,"Sunday","2012-10-28","19:48:00",2.33,"No","No","Evening & Weekend Minutes",3]
[null,"Monday","2012-10-29","11:08:00",0.38,"Yes","Yes","Weekday Daytime Minutes",1]
[null,"Monday","2012-10-29","11:25:00",1.28,"Yes","Yes","Weekday Daytime Minutes",2]
[null,"Monday","2012-10-29","11:47:00",3.21,"Yes","Yes","Weekday Daytime Minutes",4]
[null,"Monday","2012-10-29","12:42:00",0.22,{"$f":"IF(OR(B516=\"Sunday\",B516=\"Saturday\"),\"No\",\"Yes\")","v":"Yes"},{"$f":"IF(D516<0.7916,\"Yes\",\"No\")","v":"Yes"},{"$f":"IF(AND(F516=\"yes\",G516=\"yes\"),\"Weekday Daytime Minutes\",\"Evening & Weekend Minutes\")","v":"Weekday Daytime Minutes"},{"$f":"ROUNDUP(E516,0)","v":1}]
[null,"Monday","2012-10-29","13:08:00",0.21,"Yes","Yes","Weekday Daytime Minutes",1]
[null,"Monday","2012-10-29","13:11:00",0.31,"Yes","Yes","Weekday Daytime Minutes",1]
[null,"Monday","2012-10-29","13:15:00",0.23,"Yes","Yes","Weekday Daytime Minutes",1]
[null,"Monday","2012-10-29","13:31:00",0.19,"Yes","Yes","Weekday Daytime Minutes",1]
[null,"Monday","2012-10-29","13:34:00",0.26,"Yes","Yes","Weekday Daytime Minutes",1]
[null,"Monday","2012-10-29","13:40:00",0.84,"Yes","Yes","Weekday Daytime Minutes",1]
[null,"Monday","2012-10-29","14:39:00",1.29,"Yes","Yes","Weekday Daytime Minutes",2]
[null,"Monday","2012-10-29","15:15:00",1.18,"Yes","Yes","Weekday Daytime Minutes",2]
[null,"Tuesday","2012-10-30","09:48:00",1.8,"Yes","Yes","Weekday Daytime Minutes",2]
[null,"Tuesday","2012-10-30","10:06:00",0.67,"Yes","Yes","Weekday Daytime Minutes",1]
[null,"Tuesday","2012-10-30","10:14:00",0.08,"Yes","Yes","Weekday Daytime Minutes",1]
[null,"Tuesday","2012-10-30","10:19:00",0.12,"Yes","Yes","Weekday Daytime Minutes",1]
[null,"Tuesday","2012-10-30","10:27:00",0.19,"Yes","Yes","Weekday Daytime Minutes",1]
[null,"Tuesday","2012-10-30","10:30:00",0.05,"Yes","Yes","Weekday Daytime Minutes",1]
[null,"Tuesday","2012-10-30","10:33:00",0.12,"Yes","Yes","Weekday Daytime Minutes",1]
[null,"Tuesday","2012-10-30","10:46:00",0.13,"Yes","Yes","Weekday Daytime Minutes",1]
[null,"Tuesday","2012-10-30","10:49:00",0.8,"Yes","Yes","Weekday Daytime Minutes",1]
[null,"Tuesday","2012-10-30","10:57:00",2.67,"Yes","Yes","Weekday Daytime Minutes",3]
[null,"Tuesday","2012-10-30","11:29:00",2.2799999999999998,"Yes","Yes","Weekday Daytime Minutes",3]
[null,"Tuesday","2012-10-30","12:08:00",0.24,"Yes","Yes","Weekday Daytime Minutes",1]
[null,"Tuesday","2012-10-30","12:16:00",0.49,"Yes","Yes","Weekday Daytime Minutes",1]
[null,"Tuesday","2012-10-30","12:34:00",2.75,"Yes","Yes","Weekday Daytime Minutes",3]
[null,"Tuesday","2012-10-30","13:29:00",2.33,"Yes","Yes","Weekday Daytime Minutes",3]
[null,"Tuesday","2012-10-30","13:50:00",1.1499999999999999,"Yes","Yes","Weekday Daytime Minutes",2]
[null,"Tuesday","2012-10-30","14:59:00",0.62,"Yes","Yes","Weekday Daytime Minutes",1]
[null,"Tuesday","2012-10-30","15:14:00",0.11,"Yes","Yes","Weekday Daytime Minutes",1]
[null,"Tuesday","2012-10-30","15:20:00",1.83,"Yes","Yes","Weekday Daytime Minutes",2]
[null,"Tuesday","2012-10-30","15:52:00",1.82,"Yes","Yes","Weekday Daytime Minutes",2]
[null,"Wednesday","2012-10-31","10:24:00",2.83,"Yes","Yes","Weekday Daytime Minutes",3]
[null,"Wednesday","2012-10-31","11:10:00",1.4,"Yes","Yes","Weekday Daytime Minutes",2]
[null,"Wednesday","2012-10-31","11:36:00",5.15,"Yes","Yes","Weekday Daytime Minutes",6]
[null,"Wednesday","2012-10-31","12:39:00",1.4,"Yes","Yes","Weekday Daytime Minutes",2]
[null,"Wednesday","2012-10-31","12:53:00",1.7,"Yes","Yes","Weekday Daytime Minutes",2]
[null,"Wednesday","2012-10-31","13:10:00",0.28000000000000003,"Yes","Yes","Weekday Daytime Minutes",1]
[null,"Wednesday","2012-10-31","13:27:00",0.57999999999999996,"Yes","Yes","Weekday Daytime Minutes",1]
[null,"Wednesday","2012-10-31","13:40:00",1.1599999999999999,"Yes","Yes","Weekday Daytime Minutes",2]
[null,"Wednesday","2012-10-31","14:12:00",3.73,"Yes","Yes","Weekday Daytime Minutes",4]
[null,"Wednesday","2012-10-31","15:39:00",0.83,"Yes","Yes","Weekday Daytime Minutes",1]

{"sheet":"Data","index":4,"n_rows":766,"n_cols":4,"rows_kept":766,"cut":false,"hidden":false,"merged":[]}
[]
[null,"Date","Time","Data Used (Kb)"]
[null,"2012-10-01","10:28:00",1068]
[null,"2012-10-01","11:05:00",60]
[null,"2012-10-01","11:55:00",2061]
[null,"2012-10-01","12:53:00",273]
[null,"2012-10-01","13:26:00",2027]
[null,"2012-10-01","13:32:00",63]
[null,"2012-10-01","13:54:00",4]
[null,"2012-10-01","14:19:00",21]
[null,"2012-10-01","14:38:00",62]
[null,"2012-10-01","15:04:00",1181]
[null,"2012-10-01","16:06:00",90]
[null,"2012-10-01","16:08:00",46]
[null,"2012-10-01","16:33:00",476]
[null,"2012-10-01","17:20:00",88]
[null,"2012-10-01","17:24:00",1414]
[null,"2012-10-01","18:35:00",365]
[null,"2012-10-01","18:38:00",2311]
[null,"2012-10-01","18:46:00",34]
[null,"2012-10-02","11:28:00",2040]
[null,"2012-10-02","12:19:00",4104]
[null,"2012-10-02","12:53:00",3069]
[null,"2012-10-02","13:15:00",2361]
[null,"2012-10-02","13:42:00",4071]
[null,"2012-10-02","14:05:00",4038]
[null,"2012-10-02","14:45:00",3054]
[null,"2012-10-02","15:11:00",186]
[null,"2012-10-02","16:18:00",4037]
[null,"2012-10-02","17:18:00",4083]
[null,"2012-10-02","18:29:00",4014]
[null,"2012-10-02","19:10:00",71]
[null,"2012-10-02","20:53:00",10]
[null,"2012-10-02","21:07:00",1260]
[null,"2012-10-02","21:10:00",97]
[null,"2012-10-02","21:26:00",1119]
[null,"2012-10-02","21:56:00",88]
[null,"2012-10-03","11:31:00",361]
[null,"2012-10-03","12:11:00",332]
[null,"2012-10-03","13:17:00",40]
[null,"2012-10-03","14:18:00",328]
[null,"2012-10-03","15:05:00",1435]
[null,"2012-10-03","15:27:00",2382]
[null,"2012-10-03","15:36:00",62]
[null,"2012-10-03","15:43:00",25]
[null,"2012-10-03","15:49:00",2006]
[null,"2012-10-03","16:19:00",4033]
[null,"2012-10-03","16:43:00",86]
[null,"2012-10-03","17:01:00",1091]
[null,"2012-10-03","17:17:00",88]
[null,"2012-10-03","18:39:00",3284]
[null,"2012-10-03","19:07:00",46]
[null,"2012-10-03","20:59:00",2060]
[null,"2012-10-03","21:23:00",4083]
[null,"2012-10-03","21:34:00",1485]
[null,"2012-10-03","21:40:00",2380]
[null,"2012-10-03","22:02:00",55]
[null,"2012-10-03","22:31:00",3357]
[null,"2012-10-03","22:53:00",11]
[null,"2012-10-04","11:31:00",3449]
[null,"2012-10-04","12:32:00",4226]
[null,"2012-10-04","13:03:00",443]
[null,"2012-10-04","14:12:00",88]
[null,"2012-10-04","15:01:00",93]
[null,"2012-10-04","15:47:00",240]
[null,"2012-10-04","16:17:00",72]
[null,"2012-10-04","17:45:00",4072]
[null,"2012-10-04","18:50:00",224]
[null,"2012-10-04","19:49:00",268]
[null,"2012-10-04","20:52:00",378]
[null,"2012-10-04","21:07:00",4244]
[null,"2012-10-04","22:31:00",400]
[null,"2012-10-04","22:57:00",59]
[null,"2012-10-04","23:02:00",22]
[null,"2012-10-04","23:03:00",4037]
[null,"2012-10-04","23:18:00",3061]
[null,"2012-10-04","23:36:00",1388]
[null,"2012-10-04",1.007638888888889,245]
[null,"2012-10-04",1.0340277777777778,4002]
[null,"2012-10-04",1.0826388888888889,2066]
[null,"2012-10-04",1.0951388888888889,4492]
[null,"2012-10-04",1.1020833333333333,1232]
[null,"2012-10-04",1.1180555555555556,3089]
[null,"2012-10-04",1.1270833333333334,4263]
[null,"2012-10-04",1.1416666666666666,346]
[null,"2012-10-04",1.1527777777777779,56]
[null,"2012-10-04",1.2055555555555555,79]
[null,"2012-10-05","10:03:00",2096]
[null,"2012-10-05","10:15:00",2459]
[null,"2012-10-05","11:01:00",132]
[null,"2012-10-05","11:32:00",4239]
[null,"2012-10-05","12:09:00",1491]
[null,"2012-10-05","12:25:00",114]
[null,"2012-10-05","12:27:00",4016]
[null,"2012-10-05","12:56:00",3188]
[null,"2012-10-05","13:03:00",3290]
[null,"2012-10-05","13:22:00",2293]
[null,"2012-10-05","14:02:00",319]
[null,"2012-10-05","14:14:00",262]
[null,"2012-10-05","15:02:00",2054]
[null,"2012-10-05","16:24:00",6]
[null,"2012-10-05","16:30:00",308]
[null,"2012-10-05","16:48:00",4424]
[null,"2012-10-05","17:25:00",1328]
[null,"2012-10-06","10:05:00",464]
[null,"2012-10-06","11:34:00",16]
[null,"2012-10-06","11:58:00",224]
[null,"2012-10-06","11:59:00",268]
[null,"2012-10-06","12:18:00",26]
[null,"2012-10-06","13:56:00",2092]
[null,"2012-10-06","14:22:00",91]
[null,"2012-10-06","14:53:00",1013]
[null,"2012-10-06","15:15:00",3082]
[null,"2012-10-06","16:50:00",4]
[null,"2012-10-06","17:20:00",174]
[null,"2012-10-06","17:34:00",305]
[null,"2012-10-06","17:46:00",3031]
[null,"2012-10-06","18:23:00",185]
[null,"2012-10-06","18:33:00",4041]
[null,"2012-10-06","18:42:00",97]
[null,"2012-10-06","18:46:00",84]
[null,"2012-10-06","19:38:00",39]
[null,"2012-10-06","19:57:00",145]
[null,"2012-10-06","20:43:00",1064]
[null,"2012-10-06","20:44:00",438]
[null,"2012-10-06","20:58:00",304]
[null,"2012-10-06","21:12:00",2257]
[null,"2012-10-06","21:13:00",360]
[null,"2012-10-06","21:26:00",26]
[null,"2012-10-06","22:26:00",52]
[null,"2012-10-06","22:45:00",327]
[null,"2012-10-06","23:16:00",117]
[null,"2012-10-06",1.0090277777777776,443]
[null,"2012-10-06",1.0104166666666667,48]
[null,"2012-10-06",1.0145833333333334,46]
[null,"2012-10-06",1.0319444444444443,146]
[null,"2012-10-06",1.0534722222222224,10]
[null,"2012-10-06",1.0562500000000001,2044]
[null,"2012-10-07","08:01:00",4355]
[null,"2012-10-07","08:02:00",364]
[null,"2012-10-07","08:06:00",92]
[null,"2012-10-07","08:13:00",4441]
[null,"2012-10-07","08:18:00",45]
[null,"2012-10-07","08:22:00",293]
[null,"2012-10-07","08:31:00",40]
[null,"2012-10-07","09:23:00",45]
[null,"2012-10-07","09:25:00",2103]
[null,"2012-10-07","09:39:00",283]
[null,"2012-10-07","10:18:00",1097]
[null,"2012-10-07","10:35:00",331]
[null,"2012-10-07","11:02:00",17]
[null,"2012-10-07","12:02:00",2243]
[null,"2012-10-07","12:07:00",67]
[null,"2012-10-07","12:49:00",1095]
[null,"2012-10-07","13:26:00",15]
[null,"2012-10-07","13:51:00",4248]
[null,"2012-10-07","13:59:00",272]
[null,"2012-10-07","14:29:00",330]
[null,"2012-10-07","15:44:00",92]
[null,"2012-10-07","16:33:00",3496]
[null,"2012-10-07","16:40:00",2060]
[null,"2012-10-07","17:14:00",4052]
[null,"2012-10-07","17:14:00",64]
[null,"2012-10-07","17:20:00",29]
[null,"2012-10-07","17:30:00",0]
[null,"2012-10-07","18:48:00",95]
[null,"2012-10-07","19:55:00",11]
[null,"2012-10-08","07:16:00",424]
[null,"2012-10-08","07:27:00",2427]
[null,"2012-10-08","08:35:00",3099]
[null,"2012-10-08","09:15:00",34]
[null,"2012-10-08","09:45:00",1242]
[null,"2012-10-08","10:30:00",49]
[null,"2012-10-08","11:34:00",2076]
[null,"2012-10-08","12:29:00",39]
[null,"2012-10-08","13:42:00",54]
[null,"2012-10-08","14:45:00",357]
[null,"2012-10-08","15:52:00",88]
[null,"2012-10-08","16:07:00",166]
[null,"2012-10-08","17:00:00",1]
[null,"2012-10-08","17:03:00",187]
[null,"2012-10-08","18:01:00",156]
[null,"2012-10-08","18:18:00",2054]
[null,"2012-10-08","18:47:00",1007]
[null,"2012-10-08","18:56:00",205]
[null,"2012-10-08","19:13:00",1081]
[null,"2012-10-08","19:19:00",203]
[null,"2012-10-08","19:45:00",438]
[null,"2012-10-08","20:09:00",4021]
[null,"2012-10-09","12:18:00",4084]
[null,"2012-10-09","13:12:00",1290]
[null,"2012-10-09","13:43:00",2146]
[null,"2012-10-09","14:07:00",2050]
[null,"2012-10-09","14:08:00",2057]
[null,"2012-10-09","14:08:00",1087]
[null,"2012-10-09","14:13:00",3024]
[null,"2012-10-09","14:17:00",33]
[null,"2012-10-09","14:18:00",20]
[null,"2012-10-09","14:19:00",419]
[null,"2012-10-09","14:45:00",193]
[null,"2012-10-09","14:48:00",67]
[null,"2012-10-09","14:53:00",318]
[null,"2012-10-09","15:07:00",1017]
[null,"2012-10-09","16:13:00",38]
[null,"2012-10-09","16:16:00",76]
[null,"2012-10-09","16:39:00",3169]
[null,"2012-10-09","16:42:00",77]
[null,"2012-10-09","17:54:00",96]
[null,"2012-10-09","18:08:00",1070]
[null,"2012-10-09","18:13:00",9]
[null,"2012-10-09","18:13:00",37]
[null,"2012-10-09","19:31:00",19]
[null,"2012-10-09","19:52:00",2012]
[null,"2012-10-09","20:34:00",345]
[null,"2012-10-09","21:49:00",1193]
[null,"2012-10-09","22:07:00",3041]
[null,"2012-10-10","10:57:00",4180]
[null,"2012-10-10","11:05:00",88]
[null,"2012-10-10","11:06:00",37]
[null,"2012-10-10","11:28:00",3010]
[null,"2012-10-10","11:37:00",1044]
[null,"2012-10-10","11:39:00",3002]
[null,"2012-10-10","11:42:00",4071]
[null,"2012-10-10","12:17:00",4005]
[null,"2012-10-10","13:50:00",331]
[null,"2012-10-10","14:00:00",70]
[null,"2012-10-10","14:09:00",1034]
[null,"2012-10-10","14:49:00",21]
[null,"2012-10-10","15:26:00",1069]
[null,"2012-10-10","16:06:00",4066]
[null,"2012-10-10","16:29:00",2404]
[null,"2012-10-10","17:12:00",280]
[null,"2012-10-10","17:31:00",14]
[null,"2012-10-10","18:27:00",23]
[null,"2012-10-10","19:42:00",25]
[null,"2012-10-10","20:42:00",123]
[null,"2012-10-10","20:50:00",12]
[null,"2012-10-10","21:06:00",61]
[null,"2012-10-10","21:36:00",48]
[null,"2012-10-10","22:58:00",4017]
[null,"2012-10-10","23:00:00",1067]
[null,"2012-10-10","23:02:00",32]
[null,"2012-10-10","23:11:00",350]
[null,"2012-10-10","23:28:00",3016]
[null,"2012-10-10","23:42:00",2300]
[null,"2012-10-11","07:03:00",50]
[null,"2012-10-11","08:32:00",27]
[null,"2012-10-11","09:15:00",1096]
[null,"2012-10-11","10:04:00",3458]
[null,"2012-10-11","11:00:00",210]
[null,"2012-10-11","11:37:00",1095]
[null,"2012-10-11","11:40:00",146]
[null,"2012-10-11","12:09:00",96]
[null,"2012-10-11","12:20:00",1043]
[null,"2012-10-11","12:40:00",206]
[null,"2012-10-11","13:01:00",2038]
[null,"2012-10-11","14:04:00",70]
[null,"2012-10-11","14:12:00",26]
[null,"2012-10-11","14:39:00",3057]
[null,"2012-10-11","14:41:00",31]
[null,"2012-10-11","15:05:00",239]
[null,"2012-10-11","16:34:00",101]
[null,"2012-10-11","17:01:00",1415]
[null,"2012-10-11","17:11:00",3063]
[null,"2012-10-11","17:25:00",82]
[null,"2012-10-11","17:44:00",2403]
[null,"2012-10-11","17:49:00",78]
[null,"2012-10-11","18:26:00",45]
[null,"2012-10-11","18:48:00",3086]
[null,"2012-10-11","19:35:00",14]
[null,"2012-10-11","20:00:00",4281]
[null,"2012-10-11","20:05:00",239]
[null,"2012-10-11","20:22:00",43]
[null,"2012-10-11","20:43:00",1081]
[null,"2012-10-11","20:43:00",1074]
[null,"2012-10-12","09:52:00",51]
[null,"2012-10-12","10:50:00",446]
[null,"2012-10-12","11:08:00",27]
[null,"2012-10-12","12:56:00",1462]
[null,"2012-10-12","13:00:00",267]
[null,"2012-10-12","13:50:00",96]
[null,"2012-10-12","14:05:00",146]
[null,"2012-10-12","14:23:00",79]
[null,"2012-10-12","14:27:00",2028]
[null,"2012-10-12","15:09:00",2345]
[null,"2012-10-12","15:09:00",2096]
[null,"2012-10-12","15:39:00",1028]
[null,"2012-10-12","16:00:00",86]
[null,"2012-10-12","16:57:00",214]
[null,"2012-10-12","17:34:00",79]
[null,"2012-10-12","18:24:00",54]
[null,"2012-10-12","19:31:00",1066]
[null,"2012-10-12","19:38:00",322]
[null,"2012-10-12","20:08:00",278]
[null,"2012-10-12","20:47:00",0]
[null,"2012-10-12","21:03:00",93]
[null,"2012-10-12","21:56:00",31]
[null,"2012-10-12","22:18:00",378]
[null,"2012-10-13","08:31:00",63]
[null,"2012-10-13","08:38:00",34]
[null,"2012-10-13","08:40:00",66]
[null,"2012-10-13","09:31:00",67]
[null,"2012-10-13","10:04:00",68]
[null,"2012-10-13","10:16:00",246]
[null,"2012-10-13","11:26:00",2053]
[null,"2012-10-13","11:36:00",353]
[null,"2012-10-13","11:44:00",112]
[null,"2012-10-13","11:49:00",65]
[null,"2012-10-13","12:12:00",398]
[null,"2012-10-13","12:15:00",119]
[null,"2012-10-13","12:41:00",220]
[null,"2012-10-13","13:44:00",307]
[null,"2012-10-13","14:18:00",319]
[null,"2012-10-13","14:18:00",95]
[null,"2012-10-13","14:38:00",281]
[null,"2012-10-13","14:38:00",2295]
[null,"2012-10-13","14:59:00",41]
[null,"2012-10-13","15:28:00",1082]
[null,"2012-10-13","15:53:00",3]
[null,"2012-10-14","08:30:00",388]
[null,"2012-10-14","09:43:00",48]
[null,"2012-10-14","10:35:00",85]
[null,"2012-10-14","10:39:00",1001]
[null,"2012-10-14","10:49:00",392]
[null,"2012-10-14","10:54:00",5]
[null,"2012-10-14","10:56:00",494]
[null,"2012-10-14","11:12:00",2078]
[null,"2012-10-14","12:24:00",90]
[null,"2012-10-14","13:42:00",4085]
[null,"2012-10-14","14:58:00",74]
[null,"2012-10-14","15:06:00",301]
[null,"2012-10-14","15:27:00",2044]
[null,"2012-10-14","16:16:00",36]
[null,"2012-10-14","16:53:00",2011]
[null,"2012-10-14","16:56:00",3026]
[null,"2012-10-14","17:10:00",25]
[null,"2012-10-14","17:34:00",3336]
[null,"2012-10-14","17:37:00",73]
[null,"2012-10-14","18:59:00",39]
[null,"2012-10-14","19:27:00",82]
[null,"2012-10-15","10:25:00",83]
[null,"2012-10-15","11:06:00",19]
[null,"2012-10-15","12:38:00",40]
[null,"2012-10-15","12:49:00",371]
[null,"2012-10-15","13:04:00",54]
[null,"2012-10-15","14:52:00",2237]
[null,"2012-10-15","15:05:00",85]
[null,"2012-10-15","16:13:00",82]
[null,"2012-10-15","16:44:00",9]
[null,"2012-10-15","17:48:00",11]
[null,"2012-10-15","18:13:00",476]
[null,"2012-10-15","18:14:00",4194]
[null,"2012-10-15","19:03:00",4052]
[null,"2012-10-15","19:22:00",1062]
[null,"2012-10-15","19:33:00",17]
[null,"2012-10-15","19:42:00",4083]
[null,"2012-10-15","19:43:00",3036]
[null,"2012-10-15","20:13:00",55]
[null,"2012-10-15","21:22:00",220]
[null,"2012-10-15","22:53:00",2175]
[null,"2012-10-15","23:26:00",157]
[null,"2012-10-15","23:28:00",2034]
[null,"2012-10-15","23:45:00",297]
[null,"2012-10-15","23:57:00",4054]
[null,"2012-10-16","07:02:00",3074]
[null,"2012-10-16","07:20:00",4071]
[null,"2012-10-16","07:48:00",4085]
[null,"2012-10-16","07:50:00",45]
[null,"2012-10-16","08:41:00",78]
[null,"2012-10-16","08:51:00",83]
[null,"2012-10-16","09:44:00",4098]
[null,"2012-10-16","10:21:00",59]
[null,"2012-10-16","10:44:00",1326]
[null,"2012-10-16","11:37:00",2075]
[null,"2012-10-16","12:13:00",2031]
[null,"2012-10-16","12:14:00",18]
[null,"2012-10-16","13:37:00",2021]
[null,"2012-10-16","13:43:00",78]
[null,"2012-10-16","14:39:00",172]
[null,"2012-10-16","14:44:00",1210]
[null,"2012-10-16","15:45:00",26]
[null,"2012-10-16","15:59:00",4251]
[null,"2012-10-16","16:14:00",1028]
[null,"2012-10-16","17:13:00",371]
[null,"2012-10-16","17:59:00",45]
[null,"2012-10-16","18:25:00",19]
[null,"2012-10-16","18:45:00",30]
[null,"2012-10-16","19:16:00",136]
[null,"2012-10-16","19:26:00",4327]
[null,"2012-10-16","19:30:00",443]
[null,"2012-10-16","20:00:00",3010]
[null,"2012-10-16","20:06:00",4032]
[null,"2012-10-16","20:10:00",52]
[null,"2012-10-16","20:25:00",50]
[null,"2012-10-16","20:30:00",53]
[null,"2012-10-16","20:42:00",261]
[null,"2012-10-16","21:21:00",3067]
[null,"2012-10-17","11:06:00",4055]
[null,"2012-10-17","12:45:00",1010]
[null,"2012-10-17","13:34:00",1066]
[null,"2012-10-17","14:37:00",4]
[null,"2012-10-17","15:24:00",87]
[null,"2012-10-17","16:24:00",1437]
[null,"2012-10-17","17:44:00",74]
[null,"2012-10-17","18:51:00",237]
[null,"2012-10-17","19:34:00",187]
[null,"2012-10-17","19:47:00",1178]
[null,"2012-10-17","20:46:00",96]
[null,"2012-10-17","21:07:00",3086]
[null,"2012-10-17","22:01:00",334]
[null,"2012-10-17","22:09:00",235]
[null,"2012-10-17","22:24:00",42]
[null,"2012-10-17","23:04:00",90]
[null,"2012-10-17","23:56:00",435]
[null,"2012-10-17",1.0284722222222222,87]
[null,"2012-10-17",1.0291666666666666,98]
[null,"2012-10-17",1.0541666666666667,3248]
[null,"2012-10-18","11:56:00",87]
[null,"2012-10-18","12:34:00",91]
[null,"2012-10-18","12:35:00",1047]
[null,"2012-10-18","12:52:00",1010]
[null,"2012-10-18","13:12:00",326]
[null,"2012-10-18","13:23:00",3029]
[null,"2012-10-18","13:48:00",27]
[null,"2012-10-18","13:53:00",2051]
[null,"2012-10-18","14:43:00",49]
[null,"2012-10-18","15:41:00",89]
[null,"2012-10-18","16:32:00",1185]
[null,"2012-10-18","17:01:00",3000]
[null,"2012-10-18","17:16:00",4214]
[null,"2012-10-18","17:23:00",100]
[null,"2012-10-18","18:30:00",1209]
[null,"2012-10-18","19:40:00",5]
[null,"2012-10-18","19:42:00",74]
[null,"2012-10-18","20:31:00",262]
[null,"2012-10-18","21:33:00",447]
[null,"2012-10-18","22:45:00",71]
[null,"2012-10-18","23:09:00",83]
[null,"2012-10-18","23:32:00",3000]
[null,"2012-10-18","23:34:00",4051]
[null,"2012-10-18","23:36:00",362]
[null,"2012-10-18",1.0090277777777776,4245]
[null,"2012-10-18",1.0416666666666667,2039]
[null,"2012-10-18",1.1118055555555555,287]
[null,"2012-10-18",1.1500000000000001,431]
[null,"2012-10-18",1.1694444444444445,1244]
[null,"2012-10-18",1.2256944444444444,3049]
[null,"2012-10-18",1.2541666666666667,4]
[null,"2012-10-18",1.2611111111111111,4007]
[null,"2012-10-18",1.2652777777777777,22]
[null,"2012-10-18",1.2874999999999999,4143]
[null,"2012-10-18",1.3305555555555555,1480]
[null,"2012-10-18",1.3583333333333334,97]
[null,"2012-10-19","06:13:00",79]
[null,"2012-10-19","06:19:00",13]
[null,"2012-10-19","06:22:00",25]
[null,"2012-10-19","06:43:00",317]
[null,"2012-10-19","07:07:00",1058]
[null,"2012-10-19","08:00:00",61]
[null,"2012-10-19","08:32:00",93]
[null,"2012-10-19","09:34:00",3345]
[null,"2012-10-19","09:36:00",17]
[null,"2012-10-19","09:37:00",2023]
[null,"2012-10-19","09:52:00",47]
[null,"2012-10-19","10:46:00",99]
[null,"2012-10-19","11:01:00",3056]
[null,"2012-10-19","11:56:00",8]
[null,"2012-10-19","12:23:00",4089]
[null,"2012-10-19","13:13:00",1074]
[null,"2012-10-19","13:13:00",2332]
[null,"2012-10-19","13:20:00",50]
[null,"2012-10-19","13:33:00",95]
[null,"2012-10-19","13:36:00",284]
[null,"2012-10-19","14:07:00",3041]
[null,"2012-10-19","14:30:00",1094]
[null,"2012-10-19","14:48:00",41]
[null,"2012-10-20","11:33:00",4050]
[null,"2012-10-20","11:37:00",1052]
[null,"2012-10-20","12:13:00",391]
[null,"2012-10-20","12:23:00",49]
[null,"2012-10-20","12:51:00",3458]
[null,"2012-10-20","12:51:00",1055]
[null,"2012-10-20","12:57:00",129]
[null,"2012-10-20","13:22:00",425]
[null,"2012-10-20","14:14:00",2007]
[null,"2012-10-20","14:16:00",2200]
[null,"2012-10-20","14:25:00",274]
[null,"2012-10-20","15:45:00",14]
[null,"2012-10-20","15:51:00",3497]
[null,"2012-10-20","16:01:00",2267]
[null,"2012-10-20","16:21:00",32]
[null,"2012-10-20","16:27:00",347]
[null,"2012-10-20","17:21:00",3233]
[null,"2012-10-20","18:09:00",77]
[null,"2012-10-20","18:09:00",443]
[null,"2012-10-20","19:59:00",46]
[null,"2012-10-20","20:14:00",2482]
[null,"2012-10-20","20:27:00",368]
[null,"2012-10-20","20:54:00",3087]
[null,"2012-10-20","21:11:00",80]
[null,"2012-10-21","10:26:00",4001]
[null,"2012-10-21","11:14:00",193]
[null,"2012-10-21","12:03:00",2281]
[null,"2012-10-21","12:22:00",85]
[null,"2012-10-21","13:36:00",4059]
[null,"2012-10-21","13:51:00",3008]
[null,"2012-10-21","14:33:00",26]
[null,"2012-10-21","14:57:00",1082]
[null,"2012-10-21","15:03:00",2047]
[null,"2012-10-21","15:26:00",4059]
[null,"2012-10-21","15:32:00",2020]
[null,"2012-10-21","15:35:00",191]
[null,"2012-10-21","15:53:00",147]
[null,"2012-10-21","16:13:00",17]
[null,"2012-10-21","17:36:00",4086]
[null,"2012-10-21","18:06:00",67]
[null,"2012-10-21","18:10:00",120]
[null,"2012-10-21","18:17:00",1015]
[null,"2012-10-21","18:34:00",4163]
[null,"2012-10-21","18:48:00",123]
[null,"2012-10-22","10:17:00",1044]
[null,"2012-10-22","11:44:00",3067]
[null,"2012-10-22","12:00:00",35]
[null,"2012-10-22","12:25:00",167]
[null,"2012-10-22","12:49:00",166]
[null,"2012-10-22","13:32:00",1067]
[null,"2012-10-22","14:40:00",3034]
[null,"2012-10-22","15:08:00",2025]
[null,"2012-10-22","15:09:00",2019]
[null,"2012-10-22","15:24:00",1390]
[null,"2012-10-22","15:35:00",48]
[null,"2012-10-22","15:35:00",1002]
[null,"2012-10-22","16:00:00",3060]
[null,"2012-10-22","16:50:00",335]
[null,"2012-10-22","16:55:00",54]
[null,"2012-10-22","17:22:00",2008]
[null,"2012-10-22","18:55:00",140]
[null,"2012-10-22","19:55:00",34]
[null,"2012-10-22","20:09:00",96]
[null,"2012-10-22","20:28:00",63]
[null,"2012-10-22","20:44:00",108]
[null,"2012-10-22","21:24:00",88]
[null,"2012-10-22","22:16:00",1220]
[null,"2012-10-22","22:24:00",485]
[null,"2012-10-22","23:19:00",18]
[null,"2012-10-22","23:21:00",3086]
[null,"2012-10-22","23:29:00",34]
[null,"2012-10-23","09:12:00",386]
[null,"2012-10-23","09:56:00",58]
[null,"2012-10-23","10:05:00",24]
[null,"2012-10-23","10:19:00",453]
[null,"2012-10-23","11:01:00",2498]
[null,"2012-10-23","11:03:00",32]
[null,"2012-10-23","12:45:00",67]
[null,"2012-10-23","13:06:00",20]
[null,"2012-10-23","13:38:00",1072]
[null,"2012-10-23","13:42:00",15]
[null,"2012-10-23","14:19:00",91]
[null,"2012-10-23","14:30:00",62]
[null,"2012-10-23","14:40:00",16]
[null,"2012-10-23","15:44:00",458]
[null,"2012-10-23","16:24:00",80]
[null,"2012-10-23","16:35:00",4377]
[null,"2012-10-23","17:08:00",3349]
[null,"2012-10-23","17:38:00",2329]
[null,"2012-10-23","17:54:00",68]
[null,"2012-10-23","18:42:00",1020]
[null,"2012-10-24","08:11:00",2070]
[null,"2012-10-24","08:35:00",39]
[null,"2012-10-24","08:37:00",4093]
[null,"2012-10-24","08:56:00",405]
[null,"2012-10-24","09:17:00",217]
[null,"2012-10-24","09:45:00",4062]
[null,"2012-10-24","09:56:00",96]
[null,"2012-10-24","09:57:00",427]
[null,"2012-10-24","10:51:00",46]
[null,"2012-10-24","11:40:00",83]
[null,"2012-10-24","12:52:00",4]
[null,"2012-10-24","13:05:00",421]
[null,"2012-10-24","13:25:00",1073]
[null,"2012-10-24","13:32:00",389]
[null,"2012-10-24","14:17:00",4141]
[null,"2012-10-24","14:55:00",127]
[null,"2012-10-24","15:07:00",3070]
[null,"2012-10-24","16:04:00",3152]
[null,"2012-10-24","16:51:00",310]
[null,"2012-10-24","17:15:00",39]
[null,"2012-10-24","18:13:00",312]
[null,"2012-10-24","18:42:00",160]
[null,"2012-10-24","18:58:00",66]
[null,"2012-10-24","19:13:00",4053]
[null,"2012-10-24","19:24:00",1072]
[null,"2012-10-24","19:31:00",4066]
[null,"2012-10-24","20:41:00",82]
[null,"2012-10-24","20:51:00",2081]
[null,"2012-10-24","21:16:00",85]
[null,"2012-10-24","22:00:00",1337]
[null,"2012-10-24","22:51:00",4396]
[null,"2012-10-24","23:23:00",52]
[null,"2012-10-24","23:25:00",3479]
[null,"2012-10-24","23:45:00",75]
[null,"2012-10-24","23:47:00",92]
[null,"2012-10-24","23:56:00",9]
[null,"2012-10-25","07:53:00",4297]
[null,"2012-10-25","08:09:00",1077]
[null,"2012-10-25","09:21:00",4051]
[null,"2012-10-25","10:21:00",49]
[null,"2012-10-25","11:12:00",4]
[null,"2012-10-25","11:52:00",151]
[null,"2012-10-25","11:54:00",335]
[null,"2012-10-25","12:05:00",58]
[null,"2012-10-25","12:07:00",4105]
[null,"2012-10-25","12:15:00",83]
[null,"2012-10-25","12:25:00",272]
[null,"2012-10-25","13:18:00",2053]
[null,"2012-10-25","13:34:00",2096]
[null,"2012-10-25","14:32:00",1054]
[null,"2012-10-25","14:57:00",4292]
[null,"2012-10-25","15:48:00",35]
[null,"2012-10-25","16:19:00",397]
[null,"2012-10-25","17:07:00",90]
[null,"2012-10-25","18:02:00",18]
[null,"2012-10-25","18:49:00",10]
[null,"2012-10-25","19:28:00",3040]
[null,"2012-10-25","19:36:00",8]
[null,"2012-10-25","20:34:00",43]
[null,"2012-10-25","20:46:00",3094]
[null,"2012-10-25","21:33:00",36]
[null,"2012-10-26","12:55:00",32]
[null,"2012-10-26","12:59:00",22]
[null,"2012-10-26","13:36:00",96]
[null,"2012-10-26","14:18:00",2074]
[null,"2012-10-26","14:47:00",66]
[null,"2012-10-26","15:13:00",91]
[null,"2012-10-26","16:02:00",37]
[null,"2012-10-26","16:09:00",254]
[null,"2012-10-26","17:47:00",47]
[null,"2012-10-26","18:07:00",178]
[null,"2012-10-26","18:25:00",289]
[null,"2012-10-26","18:31:00",425]
[null,"2012-10-26","18:48:00",52]
[null,"2012-10-26","19:12:00",2096]
[null,"2012-10-26","19:43:00",99]
[null,"2012-10-27","06:54:00",1008]
[null,"2012-10-27","07:47:00",3200]
[null,"2012-10-27","08:08:00",53]
[null,"2012-10-27","08:11:00",92]
[null,"2012-10-27","08:16:00",3020]
[null,"2012-10-27","08:33:00",14]
[null,"2012-10-27","09:48:00",45]
[null,"2012-10-27","10:16:00",77]
[null,"2012-10-27","11:07:00",294]
[null,"2012-10-27","11:48:00",63]
[null,"2012-10-27","11:50:00",50]
[null,"2012-10-27","12:02:00",70]
[null,"2012-10-27","12:16:00",48]
[null,"2012-10-27","12:36:00",282]
[null,"2012-10-27","13:48:00",26]
[null,"2012-10-27","14:14:00",4089]
[null,"2012-10-27","14:21:00",31]
[null,"2012-10-27","14:31:00",257]
[null,"2012-10-27","15:57:00",57]
[null,"2012-10-27","16:19:00",4177]
[null,"2012-10-27","16:29:00",81]
[null,"2012-10-27","17:26:00",8]
[null,"2012-10-27","17:27:00",3134]
[null,"2012-10-27","18:30:00",3040]
[null,"2012-10-27","19:29:00",296]
[null,"2012-10-27","20:23:00",10]
[null,"2012-10-27","20:29:00",38]
[null,"2012-10-27","21:03:00",4013]
[null,"2012-10-27","22:28:00",17]
[null,"2012-10-27","23:44:00",3310]
[null,"2012-10-28","09:27:00",11]
[null,"2012-10-28","09:32:00",299]
[null,"2012-10-28","09:49:00",2452]
[null,"2012-10-28","09:51:00",31]
[null,"2012-10-28","10:02:00",90]
[null,"2012-10-28","10:06:00",2013]
[null,"2012-10-28","10:19:00",234]
[null,"2012-10-28","10:28:00",45]
[null,"2012-10-28","10:41:00",3143]
[null,"2012-10-28","10:53:00",4]
[null,"2012-10-28","11:00:00",1051]
[null,"2012-10-28","11:17:00",325]
[null,"2012-10-28","11:25:00",1098]
[null,"2012-10-28","11:37:00",16]
[null,"2012-10-28","11:38:00",24]
[null,"2012-10-28","11:38:00",415]
[null,"2012-10-28","12:33:00",354]
[null,"2012-10-28","13:45:00",80]
[null,"2012-10-29","10:21:00",300]
[null,"2012-10-29","10:23:00",173]
[null,"2012-10-29","10:24:00",282]
[null,"2012-10-29","10:31:00",2016]
[null,"2012-10-29","10:57:00",253]
[null,"2012-10-29","11:28:00",7]
[null,"2012-10-29","12:24:00",3064]
[null,"2012-10-29","12:44:00",188]
[null,"2012-10-29","13:20:00",71]
[null,"2012-10-29","14:25:00",464]
[null,"2012-10-29","14:31:00",120]
[null,"2012-10-29","14:44:00",497]
[null,"2012-10-29","15:10:00",73]
[null,"2012-10-29","16:16:00",417]
[null,"2012-10-29","16:52:00",4000]
[null,"2012-10-29","17:43:00",259]
[null,"2012-10-29","18:51:00",84]
[null,"2012-10-29","18:52:00",169]
[null,"2012-10-30","11:12:00",92]
[null,"2012-10-30","11:13:00",62]
[null,"2012-10-30","11:15:00",1054]
[null,"2012-10-30","11:53:00",69]
[null,"2012-10-30","12:23:00",350]
[null,"2012-10-30","12:28:00",21]
[null,"2012-10-30","12:54:00",397]
[null,"2012-10-30","13:06:00",484]
[null,"2012-10-30","13:24:00",370]
[null,"2012-10-30","13:24:00",1259]
[null,"2012-10-30","13:55:00",1038]
[null,"2012-10-30","14:22:00",277]
[null,"2012-10-30","15:02:00",61]
[null,"2012-10-30","15:34:00",2090]
[null,"2012-10-30","15:54:00",1062]
[null,"2012-10-30","16:18:00",3039]
[null,"2012-10-30","16:20:00",75]
[null,"2012-10-30","17:01:00",14]
[null,"2012-10-30","18:18:00",98]
[null,"2012-10-30","19:26:00",145]
[null,"2012-10-30","19:45:00",284]
[null,"2012-10-30","20:14:00",466]
[null,"2012-10-30","20:49:00",316]
[null,"2012-10-30","21:57:00",61]
[null,"2012-10-30","22:21:00",2158]
[null,"2012-10-30","22:31:00",3016]
[null,"2012-10-30","23:12:00",28]
[null,"2012-10-30","23:20:00",52]
[null,"2012-10-31","12:05:00",232]
[null,"2012-10-31","12:29:00",15]
[null,"2012-10-31","13:13:00",124]
[null,"2012-10-31","13:52:00",2325]
[null,"2012-10-31","14:36:00",4034]
[null,"2012-10-31","14:37:00",286]
[null,"2012-10-31","15:32:00",288]
[null,"2012-10-31","15:38:00",79]
[null,"2012-10-31","15:39:00",4058]
[null,"2012-10-31","15:50:00",1]
[null,"2012-10-31","16:15:00",3227]
[null,"2012-10-31","16:21:00",4000]
[null,"2012-10-31","17:16:00",2323]
[null,"2012-10-31","17:17:00",400]
[null,"2012-10-31","18:27:00",342]
[null,"2012-10-31","19:06:00",4108]
[null,"2012-10-31","19:21:00",46]
[null,"2012-10-31","19:27:00",4163]
[null,"2012-10-31","20:27:00",3423]
[null,"2012-10-31","20:30:00",84]
[null,"2012-10-31","20:43:00",228]
[null,"2012-10-31","21:14:00",12]
[null,"2012-10-31","21:17:00",1055]
[null,"2012-10-31","21:26:00",4035]
[null,"2012-10-31","21:33:00",36]
[null,"2012-10-31","21:43:00",101]
[null,"2012-10-31","21:48:00",15]
[null,"2012-10-31","22:26:00",96]
[null,"2012-10-31","22:27:00",428]

{"sheet":"Messages","index":5,"n_rows":879,"n_cols":4,"rows_kept":879,"cut":false,"hidden":false,"merged":[]}
[]
[null,"Date","Time","Type"]
[null,"2012-10-01","07:33:00","Text"]
[null,"2012-10-01","08:41:00","Text"]
[null,"2012-10-01","09:01:00","Text"]
[null,"2012-10-01","09:19:00","Text"]
[null,"2012-10-01","09:36:00","Text"]
[null,"2012-10-01","09:39:00","Text"]
[null,"2012-10-01","09:45:00","Text"]
[null,"2012-10-01","10:03:00","Text"]
[null,"2012-10-01","10:27:00","Text"]
[null,"2012-10-01","10:51:00","Text"]
[null,"2012-10-01","10:53:00","Text"]
[null,"2012-10-01","10:59:00","Text"]
[null,"2012-10-01","11:03:00","Text"]
[null,"2012-10-01","11:42:00","Media"]
[null,"2012-10-01","11:48:00","Text"]
[null,"2012-10-01","12:19:00","Text"]
[null,"2012-10-01","12:23:00","Media"]
[null,"2012-10-01","12:37:00","Text"]
[null,"2012-10-01","12:50:00","Text"]
[null,"2012-10-01","13:16:00","Text"]
[null,"2012-10-01","14:15:00","Media"]
[null,"2012-10-01","14:55:00","Text"]
[null,"2012-10-01","15:28:00","Text"]
[null,"2012-10-01","16:26:00","Text"]
[null,"2012-10-01","16:37:00","Text"]
[null,"2012-10-01","16:58:00","Text"]
[null,"2012-10-01","17:13:00","Text"]
[null,"2012-10-01","17:19:00","Text"]
[null,"2012-10-01","18:36:00","Text"]
[null,"2012-10-01","19:35:00","Text"]
[null,"2012-10-01","19:37:00","Text"]
[null,"2012-10-01","20:04:00","Text"]
[null,"2012-10-01","20:52:00","Text"]
[null,"2012-10-01","21:05:00","Text"]
[null,"2012-10-01","21:40:00","Text"]
[null,"2012-10-01","22:23:00","Text"]
[null,"2012-10-01","23:03:00","Text"]
[null,"2012-10-01",1.0111111111111111,"Media"]
[null,"2012-10-01",1.0590277777777779,"Text"]
[null,"2012-10-01",1.0951388888888889,"Media"]
[null,"2012-10-02","08:54:00","Media"]
[null,"2012-10-02","09:36:00","Text"]
[null,"2012-10-02","09:40:00","Text"]
[null,"2012-10-02","09:47:00","Text"]
[null,"2012-10-02","10:08:00","Text"]
[null,"2012-10-02","10:12:00","Text"]
[null,"2012-10-02","10:14:00","Text"]
[null,"2012-10-02","10:27:00","Text"]
[null,"2012-10-02","10:35:00","Media"]
[null,"2012-10-02","10:45:00","Text"]
[null,"2012-10-02","11:15:00","Text"]
[null,"2012-10-02","12:03:00","Text"]
[null,"2012-10-02","12:14:00","Text"]
[null,"2012-10-02","12:28:00","Text"]
[null,"2012-10-02","12:34:00","Text"]
[null,"2012-10-02","13:38:00","Text"]
[null,"2012-10-02","14:39:00","Text"]
[null,"2012-10-02","15:52:00","Text"]
[null,"2012-10-02","16:06:00","Text"]
[null,"2012-10-02","16:25:00","Media"]
[null,"2012-10-02","16:32:00","Media"]
[null,"2012-10-02","17:27:00","Text"]
[null,"2012-10-02","18:06:00","Media"]
[null,"2012-10-02","18:13:00","Media"]
[null,"2012-10-03","09:14:00","Media"]
[null,"2012-10-03","10:11:00","Media"]
[null,"2012-10-03","10:19:00","Text"]
[null,"2012-10-03","10:36:00","Text"]
[null,"2012-10-03","11:07:00","Text"]
[null,"2012-10-03","11:33:00","Media"]
[null,"2012-10-03","11:40:00","Text"]
[null,"2012-10-03","12:28:00","Text"]
[null,"2012-10-03","13:05:00","Text"]
[null,"2012-10-03","13:06:00","Text"]
[null,"2012-10-03","13:10:00","Text"]
[null,"2012-10-03","13:51:00","Text"]
[null,"2012-10-03","14:35:00","Text"]
[null,"2012-10-03","14:36:00","Text"]
[null,"2012-10-03","15:18:00","Text"]
[null,"2012-10-03","15:31:00","Text"]
[null,"2012-10-04","06:26:00","Media"]
[null,"2012-10-04","07:51:00","Text"]
[null,"2012-10-04","08:01:00","Media"]
[null,"2012-10-04","08:05:00","Text"]
[null,"2012-10-04","08:09:00","Text"]
[null,"2012-10-04","09:07:00","Text"]
[null,"2012-10-04","09:20:00","Text"]
[null,"2012-10-04","09:31:00","Text"]
[null,"2012-10-04","09:36:00","Text"]
[null,"2012-10-04","10:18:00","Media"]
[null,"2012-10-04","11:43:00","Text"]
[null,"2012-10-04","12:06:00","Text"]
[null,"2012-10-04","12:56:00","Media"]
[null,"2012-10-04","13:53:00","Media"]
[null,"2012-10-04","14:47:00","Media"]
[null,"2012-10-04","15:17:00","Text"]
[null,"2012-10-04","15:56:00","Text"]
[null,"2012-10-04","16:01:00","Text"]
[null,"2012-10-04","16:22:00","Media"]
[null,"2012-10-04","17:35:00","Text"]
[null,"2012-10-04","17:46:00","Media"]
[null,"2012-10-04","17:55:00","Text"]
[null,"2012-10-04","18:24:00","Text"]
[null,"2012-10-04","19:56:00","Text"]
[null,"2012-10-04","20:04:00","Text"]
[null,"2012-10-04","20:16:00","Text"]
[null,"2012-10-04","20:22:00","Text"]
[null,"2012-10-04","20:29:00","Media"]
[null,"2012-10-04","20:46:00","Text"]
[null,"2012-10-04","21:46:00","Text"]
[null,"2012-10-04","22:17:00","Text"]
[null,"2012-10-04","22:40:00","Text"]
[null,"2012-10-04","23:02:00","Text"]
[null,"2012-10-04","23:20:00","Text"]
[null,"2012-10-04","23:23:00","Text"]
[null,"2012-10-04","23:24:00","Text"]
[null,"2012-10-04","23:57:00","Text"]
[null,"2012-10-04",1.0402777777777776,"Text"]
[null,"2012-10-04",1.0444444444444445,"Media"]
[null,"2012-10-04",1.1034722222222222,"Media"]
[null,"2012-10-05","09:02:00","Text"]
[null,"2012-10-05","09:17:00","Text"]
[null,"2012-10-05","09:29:00","Text"]
[null,"2012-10-05","09:35:00","Text"]
[null,"2012-10-05","09:41:00","Text"]
[null,"2012-10-05","09:46:00","Text"]
[null,"2012-10-05","09:47:00","Text"]
[null,"2012-10-05","09:57:00","Text"]
[null,"2012-10-05","10:28:00","Text"]
[null,"2012-10-05","10:45:00","Text"]
[null,"2012-10-05","11:26:00","Text"]
[null,"2012-10-05","11:38:00","Text"]
[null,"2012-10-05","12:28:00","Text"]
[null,"2012-10-05","13:55:00","Text"]
[null,"2012-10-05","14:11:00","Text"]
[null,"2012-10-05","15:21:00","Media"]
[null,"2012-10-05","15:31:00","Text"]
[null,"2012-10-05","15:33:00","Text"]
[null,"2012-10-05","15:47:00","Text"]
[null,"2012-10-05","16:09:00","Text"]
[null,"2012-10-05","16:28:00","Text"]
[null,"2012-10-05","17:27:00","Text"]
[null,"2012-10-05","18:03:00","Text"]
[null,"2012-10-05","18:19:00","Media"]
[null,"2012-10-05","19:06:00","Text"]
[null,"2012-10-05","20:04:00","Text"]
[null,"2012-10-05","20:11:00","Text"]
[null,"2012-10-05","20:47:00","Text"]
[null,"2012-10-05","21:48:00","Text"]
[null,"2012-10-05","22:03:00","Media"]
[null,"2012-10-05","22:44:00","Text"]
[null,"2012-10-05","22:59:00","Text"]
[null,"2012-10-05","23:52:00","Text"]
[null,"2012-10-05","23:54:00","Text"]
[null,"2012-10-05",1.03125,"Text"]
[null,"2012-10-05",1.0604166666666666,"Text"]
[null,"2012-10-06","07:40:00","Text"]
[null,"2012-10-06","07:46:00","Text"]
[null,"2012-10-06","08:25:00","Text"]
[null,"2012-10-06","09:51:00","Text"]
[null,"2012-10-06","10:04:00","Text"]
[null,"2012-10-06","11:28:00","Text"]
[null,"2012-10-06","11:30:00","Text"]
[null,"2012-10-06","11:55:00","Text"]
[null,"2012-10-06","12:07:00","Text"]
[null,"2012-10-06","12:18:00","Text"]
[null,"2012-10-06","13:08:00","Media"]
[null,"2012-10-06","13:29:00","Text"]
[null,"2012-10-06","13:33:00","Text"]
[null,"2012-10-06","14:28:00","Text"]
[null,"2012-10-06","15:01:00","Text"]
[null,"2012-10-06","15:55:00","Text"]
[null,"2012-10-06","16:01:00","Text"]
[null,"2012-10-06","17:05:00","Text"]
[null,"2012-10-06","17:08:00","Text"]
[null,"2012-10-06","17:13:00","Text"]
[null,"2012-10-06","17:13:00","Media"]
[null,"2012-10-06","17:24:00","Text"]
[null,"2012-10-06","17:26:00","Media"]
[null,"2012-10-06","17:30:00","Text"]
[null,"2012-10-06","17:30:00","Text"]
[null,"2012-10-06","17:33:00","Text"]
[null,"2012-10-06","17:47:00","Text"]
[null,"2012-10-06","18:47:00","Text"]
[null,"2012-10-06","19:13:00","Media"]
[null,"2012-10-06","20:17:00","Text"]
[null,"2012-10-06","20:25:00","Text"]
[null,"2012-10-06","20:34:00","Text"]
[null,"2012-10-06","21:18:00","Media"]
[null,"2012-10-06","22:12:00","Text"]
[null,"2012-10-06","22:25:00","Text"]
[null,"2012-10-06","22:45:00","Text"]
[null,"2012-10-06","22:58:00","Text"]
[null,"2012-10-06","23:55:00","Text"]
[null,"2012-10-07","11:05:00","Text"]
[null,"2012-10-07","12:48:00","Text"]
[null,"2012-10-07","13:01:00","Text"]
[null,"2012-10-07","14:58:00","Text"]
[null,"2012-10-07","15:21:00","Text"]
[null,"2012-10-07","16:04:00","Text"]
[null,"2012-10-07","16:49:00","Media"]
[null,"2012-10-07","17:19:00","Text"]
[null,"2012-10-07","17:58:00","Text"]
[null,"2012-10-07","18:16:00","Text"]
[null,"2012-10-07","18:24:00","Text"]
[null,"2012-10-07","19:00:00","Text"]
[null,"2012-10-07","19:57:00","Text"]
[null,"2012-10-07","20:02:00","Text"]
[null,"2012-10-07","20:46:00","Text"]
[null,"2012-10-07","21:54:00","Text"]
[null,"2012-10-07","22:03:00","Text"]
[null,"2012-10-08","11:21:00","Text"]
[null,"2012-10-08","11:55:00","Text"]
[null,"2012-10-08","12:00:00","Text"]
[null,"2012-10-08","12:04:00","Text"]
[null,"2012-10-08","12:23:00","Text"]
[null,"2012-10-08","13:35:00","Text"]
[null,"2012-10-08","13:55:00","Text"]
[null,"2012-10-08","14:12:00","Text"]
[null,"2012-10-08","14:43:00","Media"]
[null,"2012-10-08","15:03:00","Text"]
[null,"2012-10-08","15:24:00","Text"]
[null,"2012-10-08","15:27:00","Text"]
[null,"2012-10-08","15:48:00","Text"]
[null,"2012-10-08","16:17:00","Text"]
[null,"2012-10-08","16:30:00","Media"]
[null,"2012-10-08","17:39:00","Text"]
[null,"2012-10-08","18:08:00","Text"]
[null,"2012-10-08","18:14:00","Text"]
[null,"2012-10-08","18:25:00","Text"]
[null,"2012-10-08","18:46:00","Text"]
[null,"2012-10-08","19:25:00","Text"]
[null,"2012-10-08","20:26:00","Text"]
[null,"2012-10-08","20:34:00","Text"]
[null,"2012-10-08","20:36:00","Text"]
[null,"2012-10-09","10:41:00","Text"]
[null,"2012-10-09","10:48:00","Text"]
[null,"2012-10-09","11:07:00","Text"]
[null,"2012-10-09","11:31:00","Media"]
[null,"2012-10-09","11:50:00","Text"]
[null,"2012-10-09","11:58:00","Text"]
[null,"2012-10-09","12:39:00","Text"]
[null,"2012-10-09","12:43:00","Text"]
[null,"2012-10-09","13:54:00","Media"]
[null,"2012-10-09","14:19:00","Text"]
[null,"2012-10-09","14:41:00","Text"]
[null,"2012-10-09","14:58:00","Text"]
[null,"2012-10-09","15:11:00","Text"]
[null,"2012-10-09","16:11:00","Media"]
[null,"2012-10-09","16:22:00","Text"]
[null,"2012-10-09","16:54:00","Text"]
[null,"2012-10-09","17:12:00","Media"]
[null,"2012-10-09","17:12:00","Media"]
[null,"2012-10-09","18:57:00","Text"]
[null,"2012-10-09","19:07:00","Text"]
[null,"2012-10-09","20:52:00","Text"]
[null,"2012-10-09","21:06:00","Media"]
[null,"2012-10-09","21:34:00","Text"]
[null,"2012-10-09","21:38:00","Text"]
[null,"2012-10-09","21:42:00","Text"]
[null,"2012-10-09","21:58:00","Text"]
[null,"2012-10-09","22:37:00","Text"]
[null,"2012-10-09","23:00:00","Media"]
[null,"2012-10-09","23:04:00","Media"]
[null,"2012-10-09","23:44:00","Text"]
[null,"2012-10-09","23:46:00","Text"]
[null,"2012-10-09",1.0131944444444445,"Text"]
[null,"2012-10-09",1.0340277777777778,"Text"]
[null,"2012-10-09",1.0638888888888889,"Text"]
[null,"2012-10-09",1.0694444444444444,"Media"]
[null,"2012-10-09",1.08125,"Text"]
[null,"2012-10-09",1.1083333333333334,"Text"]
[null,"2012-10-09",1.1277777777777778,"Text"]
[null,"2012-10-09",1.1708333333333334,"Text"]
[null,"2012-10-09",1.1986111111111111,"Media"]
[null,"2012-10-09",1.2375,"Text"]
[null,"2012-10-09",1.2819444444444443,"Text"]
[null,"2012-10-10","06:44:00","Text"]
[null,"2012-10-10","07:29:00","Text"]
[null,"2012-10-10","08:28:00","Text"]
[null,"2012-10-10","08:57:00","Text"]
[null,"2012-10-10","09:12:00","Text"]
[null,"2012-10-10","10:13:00","Text"]
[null,"2012-10-10","10:25:00","Text"]
[null,"2012-10-10","11:01:00","Text"]
[null,"2012-10-10","11:03:00","Text"]
[null,"2012-10-10","11:21:00","Text"]
[null,"2012-10-10","12:46:00","Text"]
[null,"2012-10-10","13:24:00","Text"]
[null,"2012-10-10","13:25:00","Text"]
[null,"2012-10-10","13:58:00","Media"]
[null,"2012-10-10","14:05:00","Text"]
[null,"2012-10-10","15:19:00","Text"]
[null,"2012-10-10","15:31:00","Text"]
[null,"2012-10-10","15:33:00","Media"]
[null,"2012-10-10","15:36:00","Text"]
[null,"2012-10-10","15:44:00","Media"]
[null,"2012-10-10","15:47:00","Text"]
[null,"2012-10-10","15:48:00","Text"]
[null,"2012-10-10","16:22:00","Text"]
[null,"2012-10-10","16:47:00","Text"]
[null,"2012-10-10","16:54:00","Media"]
[null,"2012-10-11","06:37:00","Text"]
[null,"2012-10-11","07:20:00","Text"]
[null,"2012-10-11","07:50:00","Text"]
[null,"2012-10-11","08:00:00","Text"]
[null,"2012-10-11","08:02:00","Text"]
[null,"2012-10-11","08:04:00","Text"]
[null,"2012-10-11","08:13:00","Text"]
[null,"2012-10-11","08:31:00","Text"]
[null,"2012-10-11","08:32:00","Text"]
[null,"2012-10-11","09:15:00","Text"]
[null,"2012-10-11","09:55:00","Text"]
[null,"2012-10-11","10:00:00","Text"]
[null,"2012-10-11","10:42:00","Text"]
[null,"2012-10-11","10:46:00","Text"]
[null,"2012-10-11","11:01:00","Text"]
[null,"2012-10-11","11:01:00","Text"]
[null,"2012-10-11","11:08:00","Text"]
[null,"2012-10-11","12:50:00","Text"]
[null,"2012-10-11","13:12:00","Text"]
[null,"2012-10-11","13:47:00","Text"]
[null,"2012-10-11","14:11:00","Media"]
[null,"2012-10-11","15:22:00","Text"]
[null,"2012-10-11","15:48:00","Media"]
[null,"2012-10-11","15:58:00","Media"]
[null,"2012-10-11","16:13:00","Media"]
[null,"2012-10-11","16:19:00","Media"]
[null,"2012-10-11","16:56:00","Media"]
[null,"2012-10-11","17:26:00","Media"]
[null,"2012-10-12","07:06:00","Text"]
[null,"2012-10-12","07:20:00","Text"]
[null,"2012-10-12","08:10:00","Text"]
[null,"2012-10-12","09:09:00","Text"]
[null,"2012-10-12","09:38:00","Text"]
[null,"2012-10-12","09:51:00","Text"]
[null,"2012-10-12","10:02:00","Text"]
[null,"2012-10-12","11:02:00","Text"]
[null,"2012-10-12","11:37:00","Text"]
[null,"2012-10-12","12:54:00","Text"]
[null,"2012-10-12","13:11:00","Text"]
[null,"2012-10-12","13:21:00","Text"]
[null,"2012-10-12","13:22:00","Text"]
[null,"2012-10-12","13:47:00","Text"]
[null,"2012-10-12","14:07:00","Text"]
[null,"2012-10-12","14:17:00","Text"]
[null,"2012-10-12","15:00:00","Text"]
[null,"2012-10-12","16:07:00","Text"]
[null,"2012-10-12","16:18:00","Text"]
[null,"2012-10-12","16:21:00","Media"]
[null,"2012-10-12","17:36:00","Text"]
[null,"2012-10-12","18:39:00","Text"]
[null,"2012-10-12","19:03:00","Text"]
[null,"2012-10-12","20:08:00","Text"]
[null,"2012-10-12","21:58:00","Text"]
[null,"2012-10-12","22:10:00","Text"]
[null,"2012-10-12","22:16:00","Text"]
[null,"2012-10-12","22:21:00","Media"]
[null,"2012-10-12","22:30:00","Media"]
[null,"2012-10-12","22:31:00","Text"]
[null,"2012-10-12","23:31:00","Text"]
[null,"2012-10-12","23:32:00","Text"]
[null,"2012-10-12",1.0208333333333333,"Text"]
[null,"2012-10-12",1.0458333333333334,"Text"]
[null,"2012-10-12",1.0479166666666666,"Text"]
[null,"2012-10-12",1.0847222222222224,"Text"]
[null,"2012-10-12",1.1229166666666666,"Text"]
[null,"2012-10-13","07:01:00","Text"]
[null,"2012-10-13","07:05:00","Media"]
[null,"2012-10-13","08:10:00","Media"]
[null,"2012-10-13","08:48:00","Media"]
[null,"2012-10-13","09:04:00","Text"]
[null,"2012-10-13","10:03:00","Text"]
[null,"2012-10-13","10:11:00","Text"]
[null,"2012-10-13","10:11:00","Media"]
[null,"2012-10-13","11:25:00","Text"]
[null,"2012-10-13","12:21:00","Text"]
[null,"2012-10-13","12:30:00","Text"]
[null,"2012-10-13","13:37:00","Text"]
[null,"2012-10-13","14:33:00","Text"]
[null,"2012-10-13","15:33:00","Text"]
[null,"2012-10-13","15:59:00","Media"]
[null,"2012-10-13","16:26:00","Media"]
[null,"2012-10-13","16:33:00","Text"]
[null,"2012-10-13","17:08:00","Media"]
[null,"2012-10-13","17:11:00","Media"]
[null,"2012-10-13","17:52:00","Text"]
[null,"2012-10-13","17:57:00","Media"]
[null,"2012-10-13","18:47:00","Media"]
[null,"2012-10-13","18:56:00","Text"]
[null,"2012-10-13","19:54:00","Media"]
[null,"2012-10-14","07:20:00","Text"]
[null,"2012-10-14","07:32:00","Text"]
[null,"2012-10-14","08:24:00","Text"]
[null,"2012-10-14","08:36:00","Text"]
[null,"2012-10-14","08:56:00","Text"]
[null,"2012-10-14","09:29:00","Media"]
[null,"2012-10-14","10:30:00","Text"]
[null,"2012-10-14","11:22:00","Media"]
[null,"2012-10-14","12:12:00","Text"]
[null,"2012-10-14","12:59:00","Text"]
[null,"2012-10-14","13:33:00","Text"]
[null,"2012-10-14","14:17:00","Text"]
[null,"2012-10-14","14:59:00","Text"]
[null,"2012-10-14","15:56:00","Text"]
[null,"2012-10-14","16:22:00","Media"]
[null,"2012-10-14","16:57:00","Text"]
[null,"2012-10-14","17:04:00","Text"]
[null,"2012-10-14","17:10:00","Text"]
[null,"2012-10-14","17:15:00","Text"]
[null,"2012-10-14","18:34:00","Text"]
[null,"2012-10-14","19:07:00","Text"]
[null,"2012-10-14","20:13:00","Text"]
[null,"2012-10-14","21:09:00","Text"]
[null,"2012-10-14","21:11:00","Text"]
[null,"2012-10-15","09:54:00","Text"]
[null,"2012-10-15","10:59:00","Text"]
[null,"2012-10-15","11:42:00","Text"]
[null,"2012-10-15","11:45:00","Text"]
[null,"2012-10-15","11:54:00","Text"]
[null,"2012-10-15","12:14:00","Text"]
[null,"2012-10-15","12:59:00","Media"]
[null,"2012-10-15","13:53:00","Media"]
[null,"2012-10-15","13:56:00","Media"]
[null,"2012-10-15","14:03:00","Media"]
[null,"2012-10-15","15:45:00","Text"]
[null,"2012-10-15","16:13:00","Media"]
[null,"2012-10-15","17:59:00","Text"]
[null,"2012-10-15","18:09:00","Text"]
[null,"2012-10-15","18:10:00","Media"]
[null,"2012-10-15","18:17:00","Text"]
[null,"2012-10-15","18:25:00","Text"]
[null,"2012-10-15","18:33:00","Text"]
[null,"2012-10-15","18:53:00","Text"]
[null,"2012-10-15","19:52:00","Text"]
[null,"2012-10-15","20:45:00","Text"]
[null,"2012-10-15","20:54:00","Text"]
[null,"2012-10-15","21:00:00","Text"]
[null,"2012-10-15","21:22:00","Text"]
[null,"2012-10-15","21:23:00","Text"]
[null,"2012-10-15","21:26:00","Text"]
[null,"2012-10-15","21:56:00","Media"]
[null,"2012-10-15","22:15:00","Media"]
[null,"2012-10-15","22:34:00","Media"]
[null,"2012-10-15","22:34:00","Text"]
[null,"2012-10-15","22:43:00","Text"]
[null,"2012-10-15","23:19:00","Media"]
[null,"2012-10-15","23:36:00","Text"]
[null,"2012-10-15",1.0208333333333333,"Text"]
[null,"2012-10-16","09:00:00","Text"]
[null,"2012-10-16","09:11:00","Text"]
[null,"2012-10-16","09:18:00","Text"]
[null,"2012-10-16","09:34:00","Media"]
[null,"2012-10-16","09:52:00","Text"]
[null,"2012-10-16","10:23:00","Text"]
[null,"2012-10-16","10:44:00","Text"]
[null,"2012-10-16","10:53:00","Text"]
[null,"2012-10-16","11:44:00","Media"]
[null,"2012-10-16","12:44:00","Text"]
[null,"2012-10-16","13:41:00","Media"]
[null,"2012-10-16","14:16:00","Text"]
[null,"2012-10-16","14:23:00","Media"]
[null,"2012-10-16","14:38:00","Text"]
[null,"2012-10-16","14:41:00","Text"]
[null,"2012-10-16","14:54:00","Text"]
[null,"2012-10-16","15:13:00","Text"]
[null,"2012-10-17","08:21:00","Media"]
[null,"2012-10-17","08:42:00","Media"]
[null,"2012-10-17","08:42:00","Text"]
[null,"2012-10-17","08:48:00","Text"]
[null,"2012-10-17","09:29:00","Media"]
[null,"2012-10-17","10:12:00","Text"]
[null,"2012-10-17","10:16:00","Text"]
[null,"2012-10-17","10:23:00","Media"]
[null,"2012-10-17","10:30:00","Text"]
[null,"2012-10-17","11:49:00","Text"]
[null,"2012-10-17","12:23:00","Text"]
[null,"2012-10-17","12:27:00","Text"]
[null,"2012-10-17","12:45:00","Text"]
[null,"2012-10-17","12:54:00","Text"]
[null,"2012-10-17","13:30:00","Text"]
[null,"2012-10-17","13:49:00","Text"]
[null,"2012-10-17","14:11:00","Text"]
[null,"2012-10-17","14:11:00","Text"]
[null,"2012-10-17","15:58:00","Media"]
[null,"2012-10-17","16:04:00","Media"]
[null,"2012-10-17","17:12:00","Text"]
[null,"2012-10-17","18:11:00","Text"]
[null,"2012-10-17","18:14:00","Text"]
[null,"2012-10-17","19:10:00","Text"]
[null,"2012-10-17","19:57:00","Text"]
[null,"2012-10-17","20:06:00","Media"]
[null,"2012-10-17","20:13:00","Text"]
[null,"2012-10-17","20:38:00","Text"]
[null,"2012-10-17","21:51:00","Media"]
[null,"2012-10-17","22:03:00","Media"]
[null,"2012-10-17","22:24:00","Media"]
[null,"2012-10-17","22:30:00","Text"]
[null,"2012-10-17","22:34:00","Text"]
[null,"2012-10-17","23:23:00","Text"]
[null,"2012-10-17","23:23:00","Text"]
[null,"2012-10-17","23:23:00","Text"]
[null,"2012-10-17","23:35:00","Text"]
[null,"2012-10-18","09:13:00","Text"]
[null,"2012-10-18","09:34:00","Text"]
[null,"2012-10-18","10:43:00","Text"]
[null,"2012-10-18","11:11:00","Media"]
[null,"2012-10-18","12:23:00","Text"]
[null,"2012-10-18","13:20:00","Media"]
[null,"2012-10-18","14:59:00","Text"]
[null,"2012-10-18","15:30:00","Text"]
[null,"2012-10-18","15:38:00","Media"]
[null,"2012-10-18","15:57:00","Text"]
[null,"2012-10-18","16:11:00","Text"]
[null,"2012-10-18","16:19:00","Text"]
[null,"2012-10-18","17:07:00","Text"]
[null,"2012-10-18","17:13:00","Media"]
[null,"2012-10-18","18:44:00","Text"]
[null,"2012-10-18","19:02:00","Text"]
[null,"2012-10-18","20:49:00","Text"]
[null,"2012-10-18","20:54:00","Text"]
[null,"2012-10-18","21:13:00","Text"]
[null,"2012-10-18","22:00:00","Text"]
[null,"2012-10-18","22:14:00","Text"]
[null,"2012-10-18","22:50:00","Text"]
[null,"2012-10-18","22:50:00","Text"]
[null,"2012-10-18","22:50:00","Text"]
[null,"2012-10-18","22:50:00","Media"]
[null,"2012-10-18","22:50:00","Text"]
[null,"2012-10-18","23:10:00","Media"]
[null,"2012-10-18","23:10:00","Text"]
[null,"2012-10-18","23:11:00","Text"]
[null,"2012-10-18","23:37:00","Text"]
[null,"2012-10-18","23:37:00","Media"]
[null,"2012-10-18","23:55:00","Text"]
[null,"2012-10-18","23:55:00","Media"]
[null,"2012-10-18","23:55:00","Media"]
[null,"2012-10-18","23:55:00","Text"]
[null,"2012-10-18","23:55:00","Text"]
[null,"2012-10-18","23:55:00","Media"]
[null,"2012-10-19","10:28:00","Text"]
[null,"2012-10-19","11:31:00","Text"]
[null,"2012-10-19","11:46:00","Text"]
[null,"2012-10-19","12:04:00","Text"]
[null,"2012-10-19","12:07:00","Media"]
[null,"2012-10-19","12:14:00","Text"]
[null,"2012-10-19","12:36:00","Text"]
[null,"2012-10-19","12:39:00","Media"]
[null,"2012-10-19","13:34:00","Text"]
[null,"2012-10-19","14:06:00","Media"]
[null,"2012-10-19","14:34:00","Text"]
[null,"2012-10-19","14:50:00","Text"]
[null,"2012-10-19","14:55:00","Text"]
[null,"2012-10-19","15:16:00","Text"]
[null,"2012-10-19","15:18:00","Text"]
[null,"2012-10-19","15:50:00","Text"]
[null,"2012-10-19","16:44:00","Text"]
[null,"2012-10-19","16:53:00","Media"]
[null,"2012-10-19","17:01:00","Text"]
[null,"2012-10-19","17:16:00","Text"]
[null,"2012-10-19","17:17:00","Text"]
[null,"2012-10-19","17:55:00","Text"]
[null,"2012-10-19","18:32:00","Text"]
[null,"2012-10-19","19:12:00","Media"]
[null,"2012-10-19","19:41:00","Text"]
[null,"2012-10-19","20:18:00","Text"]
[null,"2012-10-19","21:00:00","Text"]
[null,"2012-10-19","21:27:00","Text"]
[null,"2012-10-20","07:18:00","Media"]
[null,"2012-10-20","08:35:00","Media"]
[null,"2012-10-20","08:53:00","Text"]
[null,"2012-10-20","09:14:00","Text"]
[null,"2012-10-20","09:27:00","Text"]
[null,"2012-10-20","09:49:00","Text"]
[null,"2012-10-20","10:23:00","Text"]
[null,"2012-10-20","11:09:00","Text"]
[null,"2012-10-20","12:15:00","Text"]
[null,"2012-10-20","12:52:00","Media"]
[null,"2012-10-20","13:03:00","Text"]
[null,"2012-10-20","13:51:00","Text"]
[null,"2012-10-20","13:57:00","Text"]
[null,"2012-10-20","14:41:00","Media"]
[null,"2012-10-20","15:00:00","Media"]
[null,"2012-10-20","16:04:00","Text"]
[null,"2012-10-20","17:17:00","Text"]
[null,"2012-10-20","18:05:00","Text"]
[null,"2012-10-20","18:20:00","Text"]
[null,"2012-10-20","19:04:00","Text"]
[null,"2012-10-20","19:09:00","Media"]
[null,"2012-10-20","19:12:00","Text"]
[null,"2012-10-20","20:43:00","Media"]
[null,"2012-10-20","20:57:00","Media"]
[null,"2012-10-20","21:05:00","Text"]
[null,"2012-10-20","21:10:00","Text"]
[null,"2012-10-20","21:26:00","Text"]
[null,"2012-10-20","21:49:00","Text"]
[null,"2012-10-20","22:07:00","Text"]
[null,"2012-10-20","23:10:00","Text"]
[null,"2012-10-20","23:10:00","Text"]
[null,"2012-10-20","23:38:00","Text"]
[null,"2012-10-20","23:38:00","Text"]
[null,"2012-10-21","07:59:00","Media"]
[null,"2012-10-21","08:09:00","Text"]
[null,"2012-10-21","09:45:00","Text"]
[null,"2012-10-21","10:04:00","Text"]
[null,"2012-10-21","10:34:00","Text"]
[null,"2012-10-21","11:21:00","Text"]
[null,"2012-10-21","11:48:00","Text"]
[null,"2012-10-21","11:51:00","Text"]
[null,"2012-10-21","11:59:00","Text"]
[null,"2012-10-21","12:08:00","Text"]
[null,"2012-10-21","12:46:00","Text"]
[null,"2012-10-21","13:24:00","Media"]
[null,"2012-10-21","14:18:00","Text"]
[null,"2012-10-21","14:23:00","Media"]
[null,"2012-10-21","14:39:00","Text"]
[null,"2012-10-21","14:51:00","Text"]
[null,"2012-10-21","15:37:00","Text"]
[null,"2012-10-21","16:22:00","Text"]
[null,"2012-10-21","17:11:00","Media"]
[null,"2012-10-21","18:01:00","Text"]
[null,"2012-10-21","19:13:00","Text"]
[null,"2012-10-21","19:23:00","Media"]
[null,"2012-10-21","20:42:00","Text"]
[null,"2012-10-21","20:50:00","Text"]
[null,"2012-10-21","21:45:00","Text"]
[null,"2012-10-22","11:17:00","Media"]
[null,"2012-10-22","12:57:00","Media"]
[null,"2012-10-22","13:10:00","Text"]
[null,"2012-10-22","13:14:00","Text"]
[null,"2012-10-22","13:51:00","Text"]
[null,"2012-10-22","13:54:00","Text"]
[null,"2012-10-22","14:52:00","Media"]
[null,"2012-10-22","14:59:00","Text"]
[null,"2012-10-22","15:02:00","Text"]
[null,"2012-10-22","15:36:00","Text"]
[null,"2012-10-22","16:04:00","Text"]
[null,"2012-10-22","16:56:00","Text"]
[null,"2012-10-22","17:03:00","Text"]
[null,"2012-10-22","18:16:00","Text"]
[null,"2012-10-22","18:18:00","Text"]
[null,"2012-10-22","18:22:00","Text"]
[null,"2012-10-22","18:56:00","Text"]
[null,"2012-10-22","19:19:00","Text"]
[null,"2012-10-23","09:16:00","Text"]
[null,"2012-10-23","10:34:00","Media"]
[null,"2012-10-23","11:50:00","Text"]
[null,"2012-10-23","11:54:00","Text"]
[null,"2012-10-23","12:39:00","Text"]
[null,"2012-10-23","13:19:00","Text"]
[null,"2012-10-23","14:00:00","Media"]
[null,"2012-10-23","14:08:00","Text"]
[null,"2012-10-23","14:08:00","Media"]
[null,"2012-10-23","14:27:00","Text"]
[null,"2012-10-23","15:02:00","Text"]
[null,"2012-10-23","15:03:00","Text"]
[null,"2012-10-23","15:16:00","Media"]
[null,"2012-10-23","15:48:00","Text"]
[null,"2012-10-23","15:57:00","Text"]
[null,"2012-10-23","15:58:00","Text"]
[null,"2012-10-24","08:37:00","Text"]
[null,"2012-10-24","09:22:00","Text"]
[null,"2012-10-24","10:07:00","Text"]
[null,"2012-10-24","10:48:00","Media"]
[null,"2012-10-24","11:36:00","Media"]
[null,"2012-10-24","12:53:00","Text"]
[null,"2012-10-24","13:13:00","Media"]
[null,"2012-10-24","13:33:00","Text"]
[null,"2012-10-24","14:13:00","Text"]
[null,"2012-10-24","14:58:00","Media"]
[null,"2012-10-24","15:27:00","Media"]
[null,"2012-10-24","15:41:00","Media"]
[null,"2012-10-24","15:50:00","Text"]
[null,"2012-10-24","15:55:00","Text"]
[null,"2012-10-24","16:17:00","Text"]
[null,"2012-10-24","16:20:00","Text"]
[null,"2012-10-24","16:23:00","Text"]
[null,"2012-10-24","16:59:00","Media"]
[null,"2012-10-24","17:19:00","Text"]
[null,"2012-10-24","17:27:00","Text"]
[null,"2012-10-24","18:44:00","Text"]
[null,"2012-10-24","19:46:00","Text"]
[null,"2012-10-24","20:20:00","Media"]
[null,"2012-10-24","21:25:00","Media"]
[null,"2012-10-24","22:15:00","Text"]
[null,"2012-10-24","22:17:00","Text"]
[null,"2012-10-24","22:17:00","Media"]
[null,"2012-10-24","22:36:00","Media"]
[null,"2012-10-24","22:36:00","Text"]
[null,"2012-10-24","22:37:00","Text"]
[null,"2012-10-24","22:37:00","Text"]
[null,"2012-10-25","09:59:00","Text"]
[null,"2012-10-25","10:09:00","Media"]
[null,"2012-10-25","10:39:00","Text"]
[null,"2012-10-25","11:14:00","Text"]
[null,"2012-10-25","12:00:00","Text"]
[null,"2012-10-25","12:09:00","Text"]
[null,"2012-10-25","12:21:00","Text"]
[null,"2012-10-25","13:04:00","Text"]
[null,"2012-10-25","13:35:00","Text"]
[null,"2012-10-25","14:19:00","Text"]
[null,"2012-10-25","15:32:00","Text"]
[null,"2012-10-25","16:00:00","Media"]
[null,"2012-10-25","17:41:00","Text"]
[null,"2012-10-25","18:43:00","Text"]
[null,"2012-10-25","18:59:00","Text"]
[null,"2012-10-25","19:47:00","Media"]
[null,"2012-10-25","20:28:00","Text"]
[null,"2012-10-25","20:28:00","Text"]
[null,"2012-10-25","20:28:00","Text"]
[null,"2012-10-25","20:30:00","Text"]
[null,"2012-10-25","20:30:00","Media"]
[null,"2012-10-25","20:30:00","Text"]
[null,"2012-10-25","20:51:00","Text"]
[null,"2012-10-25","20:51:00","Text"]
[null,"2012-10-25","20:51:00","Text"]
[null,"2012-10-25","21:35:00","Text"]
[null,"2012-10-25","21:35:00","Media"]
[null,"2012-10-25","21:35:00","Text"]
[null,"2012-10-25","22:41:00","Media"]
[null,"2012-10-25","22:41:00","Text"]
[null,"2012-10-25","22:41:00","Text"]
[null,"2012-10-25","23:09:00","Text"]
[null,"2012-10-25","23:09:00","Text"]
[null,"2012-10-25","23:25:00","Text"]
[null,"2012-10-25","23:28:00","Text"]
[null,"2012-10-25","23:28:00","Text"]
[null,"2012-10-25","23:32:00","Text"]
[null,"2012-10-25","23:32:00","Media"]
[null,"2012-10-26","10:23:00","Text"]
[null,"2012-10-26","11:35:00","Text"]
[null,"2012-10-26","12:50:00","Text"]
[null,"2012-10-26","12:54:00","Text"]
[null,"2012-10-26","13:43:00","Text"]
[null,"2012-10-26","13:45:00","Text"]
[null,"2012-10-26","14:03:00","Text"]
[null,"2012-10-26","15:55:00","Text"]
[null,"2012-10-26","16:21:00","Text"]
[null,"2012-10-26","16:38:00","Text"]
[null,"2012-10-26","17:20:00","Text"]
[null,"2012-10-26","17:25:00","Text"]
[null,"2012-10-26","17:43:00","Media"]
[null,"2012-10-26","18:33:00","Text"]
[null,"2012-10-26","19:38:00","Text"]
[null,"2012-10-26","23:25:00","Text"]
[null,"2012-10-27","06:06:00","Text"]
[null,"2012-10-27","06:19:00","Text"]
[null,"2012-10-27","06:46:00","Text"]
[null,"2012-10-27","06:46:00","Text"]
[null,"2012-10-27","06:53:00","Text"]
[null,"2012-10-27","07:04:00","Text"]
[null,"2012-10-27","07:46:00","Text"]
[null,"2012-10-27","07:51:00","Text"]
[null,"2012-10-27","08:32:00","Media"]
[null,"2012-10-27","08:33:00","Text"]
[null,"2012-10-27","08:33:00","Text"]
[null,"2012-10-27","08:51:00","Text"]
[null,"2012-10-27","09:01:00","Text"]
[null,"2012-10-27","10:04:00","Text"]
[null,"2012-10-27","10:12:00","Text"]
[null,"2012-10-27","11:08:00","Media"]
[null,"2012-10-28","11:00:00","Text"]
[null,"2012-10-28","11:35:00","Media"]
[null,"2012-10-28","12:50:00","Text"]
[null,"2012-10-28","13:17:00","Text"]
[null,"2012-10-28","14:54:00","Text"]
[null,"2012-10-28","15:52:00","Text"]
[null,"2012-10-28","16:38:00","Text"]
[null,"2012-10-28","17:06:00","Text"]
[null,"2012-10-28","18:01:00","Text"]
[null,"2012-10-28","19:10:00","Text"]
[null,"2012-10-28","20:10:00","Text"]
[null,"2012-10-28","20:28:00","Text"]
[null,"2012-10-28","20:28:00","Media"]
[null,"2012-10-28","20:28:00","Text"]
[null,"2012-10-28","20:28:00","Text"]
[null,"2012-10-28","20:30:00","Text"]
[null,"2012-10-28","20:30:00","Media"]
[null,"2012-10-28","20:30:00","Text"]
[null,"2012-10-28","20:30:00","Text"]
[null,"2012-10-28","20:51:00","Text"]
[null,"2012-10-28","20:51:00","Text"]
[null,"2012-10-28","20:51:00","Text"]
[null,"2012-10-28","20:51:00","Text"]
[null,"2012-10-28","20:57:00","Media"]
[null,"2012-10-28","21:11:00","Text"]
[null,"2012-10-28","21:35:00","Text"]
[null,"2012-10-28","21:35:00","Media"]
[null,"2012-10-28","21:35:00","Text"]
[null,"2012-10-28","22:06:00","Text"]
[null,"2012-10-28","22:11:00","Text"]
[null,"2012-10-28","22:41:00","Text"]
[null,"2012-10-28","22:41:00","Text"]
[null,"2012-10-28","22:56:00","Text"]
[null,"2012-10-28","23:09:00","Media"]
[null,"2012-10-28","23:09:00","Text"]
[null,"2012-10-28","23:25:00","Media"]
[null,"2012-10-28","23:25:00","Text"]
[null,"2012-10-28","23:28:00","Text"]
[null,"2012-10-28","23:28:00","Text"]
[null,"2012-10-28","23:29:00","Text"]
[null,"2012-10-28","23:32:00","Media"]
[null,"2012-10-28","23:32:00","Text"]
[null,"2012-10-29","07:12:00","Text"]
[null,"2012-10-29","08:06:00","Text"]
[null,"2012-10-29","08:20:00","Text"]
[null,"2012-10-29","09:14:00","Text"]
[null,"2012-10-29","10:10:00","Text"]
[null,"2012-10-29","11:37:00","Text"]
[null,"2012-10-29","12:13:00","Text"]
[null,"2012-10-29","12:39:00","Text"]
[null,"2012-10-29","13:05:00","Text"]
[null,"2012-10-29","13:14:00","Text"]
[null,"2012-10-29","13:23:00","Text"]
[null,"2012-10-29","13:59:00","Text"]
[null,"2012-10-29","14:18:00","Media"]
[null,"2012-10-29","14:37:00","Text"]
[null,"2012-10-29","14:37:00","Text"]
[null,"2012-10-29","15:33:00","Text"]
[null,"2012-10-29","15:39:00","Text"]
[null,"2012-10-29","15:50:00","Text"]
[null,"2012-10-29","16:18:00","Media"]
[null,"2012-10-29","16:38:00","Text"]
[null,"2012-10-29","17:20:00","Text"]
[null,"2012-10-29","17:53:00","Text"]
[null,"2012-10-29","18:25:00","Media"]
[null,"2012-10-29","18:53:00","Text"]
[null,"2012-10-29","19:46:00","Text"]
[null,"2012-10-29","20:28:00","Text"]
[null,"2012-10-29","20:30:00","Text"]
[null,"2012-10-29","20:51:00","Text"]
[null,"2012-10-29","21:35:00","Text"]
[null,"2012-10-29","22:41:00","Text"]
[null,"2012-10-29","23:09:00","Media"]
[null,"2012-10-29","23:28:00","Media"]
[null,"2012-10-29","23:32:00","Text"]
[null,"2012-10-30","09:26:00","Media"]
[null,"2012-10-30","10:26:00","Text"]
[null,"2012-10-30","10:32:00","Media"]
[null,"2012-10-30","10:42:00","Text"]
[null,"2012-10-30","11:49:00","Text"]
[null,"2012-10-30","12:56:00","Text"]
[null,"2012-10-30","13:00:00","Text"]
[null,"2012-10-30","13:20:00","Text"]
[null,"2012-10-30","13:28:00","Text"]
[null,"2012-10-30","13:50:00","Text"]
[null,"2012-10-30","14:28:00","Text"]
[null,"2012-10-30","14:49:00","Text"]
[null,"2012-10-30","14:49:00","Text"]
[null,"2012-10-30","14:50:00","Media"]
[null,"2012-10-30","14:56:00","Text"]
[null,"2012-10-30","15:40:00","Media"]
[null,"2012-10-30","15:41:00","Text"]
[null,"2012-10-30","15:45:00","Text"]
[null,"2012-10-30","15:55:00","Text"]
[null,"2012-10-30","16:01:00","Media"]
[null,"2012-10-30","16:29:00","Text"]
[null,"2012-10-30","17:12:00","Text"]
[null,"2012-10-30","23:25:00","Text"]
[null,"2012-10-31","11:10:00","Media"]
[null,"2012-10-31","12:21:00","Text"]
[null,"2012-10-31","12:47:00","Media"]
[null,"2012-10-31","13:06:00","Text"]
[null,"2012-10-31","13:15:00","Text"]
[null,"2012-10-31","13:53:00","Media"]
[null,"2012-10-31","13:59:00","Text"]
[null,"2012-10-31","14:09:00","Text"]
[null,"2012-10-31","14:45:00","Media"]
[null,"2012-10-31","15:01:00","Text"]
[null,"2012-10-31","15:48:00","Text"]
[null,"2012-10-31","16:30:00","Text"]
[null,"2012-10-31","17:55:00","Text"]
[null,"2012-10-31","17:58:00","Text"]
[null,"2012-10-31","18:49:00","Media"]
[null,"2012-10-31","19:33:00","Text"]
[null,"2012-10-31","19:39:00","Media"]
[null,"2012-10-31","20:14:00","Media"]

{"sheet":"CashFlow","index":6,"n_rows":40,"n_cols":12,"rows_kept":40,"cut":false,"hidden":false,"merged":[[1,1,1,9],[2,11,5,16],[37,1,38,9],[39,1,39,9]]}
[]
[null,"Cash Flow Budget Worksheet"]
[null,"Monthly Interest Rate",1.4999999999999999E-2,null,null,null,null,null,null,null,null,"Complete the statement of cash flow for January through June by completing the tasks. As part of the process you will need to use a circular reference. You will need to set Excel to handle circular references. "]
[]
[null,"Line of Credit Needed",{"$f":"10000","v":10000}]
[]
[null,null,"December","January","February","March","April","May","June"]
[null,"Beginning Cash Balance",null,5000,{"$f":"D36","v":0},{"$f":"E36","v":0},{"$f":"F36","v":0},{"$f":"G36","v":8591.382500000007},{"$f":"H36","v":20212.610000000015}]
[]
[null,"Cash Inflows (Income):"]
[null,"Customer Payments",null,35000,45000,53000,64680,76540,90540]
[null,"Cash Sales",null,52000,62000,73500,86000,100600,117700]
[null,"Total Cash Inflows",null,{"$f":"SUM(D11:D12)","v":87000},{"$f":"SUM(E11:E12)","v":107000},{"$f":"SUM(F11:F12)","v":126500},{"$f":"SUM(G11:G12)","v":150680},{"$f":"SUM(H11:H12)","v":177140},{"$f":"SUM(I11:I12)","v":208240}]
[]
[null,"Cash Outflows (Expenses):"]
[null,"Advertising",null,20000,30000,35000,40000,50000,60000]
[null,"Loan Interest",null,{"$f":"C34*$C$3","v":0},{"$f":"D34*$C$3","v":186},-25.5,14.6175,-29.227499999999999,7.4999999999999997E-3]
[null,"Insurance",null,4500,4500,4500,4500,4500,4500]
[null,"Inventory Purchases",null,46000,53000,54500,59800,71900,83300]
[null,"Office Supplies",null,3200,3200,3200,3500,4000,4000]
[null,"Payroll",null,11000,12000,13500,18100,17700,23200]
[null,"Rent or Lease",null,12000,12000,12000,12000,12000,12000]
[null,"Utilities & Telephone",null,2700,3000,3100,3200,3500,5000]
[null,"Total Expenses",null,{"$f":"SUM(D16:D23)","v":99400},{"$f":"SUM(E16:E23)","v":117886},{"$f":"SUM(F16:F23)","v":125774.5},{"$f":"SUM(G16:G23)","v":141114.61749999999},{"$f":"SUM(H16:H23)","v":163570.77249999999},{"$f":"SUM(I16:I23)","v":192000.00750000001}]
[]
[null,"Cash Flows (Net):",null,{"$f":"D13-D24","v":-12400},{"$f":"E13-E24","v":-10886},{"$f":"F13-F24","v":725.5},{"$f":"G13-G24","v":9565.382500000007},{"$f":"H13-H24","v":13569.227500000008},{"$f":"I13-I24","v":16239.992499999993}]
[]
[null,"Shortfall/Surplus Cash","$6000.00*",{"$f":"SUM(D8,D26)","v":-7400},{"$f":"SUM(E8,E26)","v":-10886},{"$f":"SUM(F8,F26)","v":725.5},{"$f":"SUM(G8,G26)","v":9565.382500000007},{"$f":"SUM(H8,H26)","v":22160.610000000015},{"$f":"SUM(I8,I26)","v":36452.602500000008}]
[]
[null,"Loan Calculatations"]
[null,"Additional Cash Needed",0,12400,10700,0,0,0,0]
[null,"Cash Available to Retire Debt",6000,0,0,{"$f":"F28","v":725.5},{"$f":"G28","v":9565.382500000007},{"$f":"H28","v":22160.610000000015},{"$f":"I28","v":36452.602500000008}]
[null,"Cash Used to Retire Debt",1000,0,0,725.5,{"$f":"974","v":974},{"$f":"1948","v":1948},{"$f":"0.5","v":0.5}]
[null,"Loan Balance**",0,{"$f":"D31-(D33+C34)","v":12400},{"$f":"E31-(E33+D34)","v":-1700},{"$f":"F31-(F33+E34)","v":974.5},{"$f":"G31-(G33+F34)","v":-1948.5},{"$f":"H31-(H33+G34)","v":0.5},{"$f":"I31-(I33+H34)","v":-1}]
[]
[null,"Ending Cash Balance",5000,{"$f":"D32-D33","v":0},{"$f":"E32-E33","v":0},{"$f":"F32-F33","v":0},{"$f":"G32-G33","v":8591.382500000007},{"$f":"H32-H33","v":20212.610000000015},{"$f":"I32-I33","v":36452.102500000008}]
[]
[null,"* Note: there was a loan balance of $1000 in November which was paid to $0 with the cash surplus in December. This is why the beginning cash value in January is $1000 less than the ending cash in December."]
[]
[null,"** A loan taken out in any given month cannot be paid off in that month. The earliest a loan will be paid off will be the next month. "]